Page MenuHomeWildfire Games

Clean up Obstruction: remove "Active" hack and remove "Block Construction" flag.
Changes PlannedPublic

Authored by wraitii on Nov 23 2020, 6:38 PM.

Details

Reviewers
Freagarach
Summary

Hear me out on this one.
The "active" flag is intended as a temporary workaround to disable an obstruction. It's currently used by turrets to de-activate the turreted obstructions.
There is another mechanism that does something somewhat similar, but can only disable "block movement" and "block pathfinding". That's used for gates.
It seems like these would probably be somewhat redundant. They're not.

The 'trick' is that gates (resp. foundations) get a list of 'colliding entities' to know if they should open/close (resp. be built). These entities are basically intended to be moving units. For gates, we want to consider stuff that moves/blocks movement (TBH those two concepts aren't really the same, but close enough right now). For foundations, it's kind of arbitrary, but there's basically three kinds of entities: those that can move, those that are deleted on construction (and don't block movement), and those that block foundations in the first place.

This is all a little weird, and has led to bugs before. Namely, D1445 / rP21702 made structures not block construction, only placing foundations, to work around an issue with walls on skirmish maps. I had a similar issue with skirmish-map-walls in rP23710.

The fact of the moment is that we don't really need this "block construction" flag. It's arbitrary. It's also 1-1 with "block movement" for units. So foundations can just check for units that block movements, and gates too.

This also fixes a bug with gates (unsure when it was introduced TBH, there's been changes there), where units that ungarrison from gates no longer properly open gates.

With that, we can also remove the "active" bit.

NB: the reason this diff exists it that' I'm trying something to clean up D14 down the line.

Test Plan

Test gates, gates from skirmish maps, constructing stuff. Agree with the changes.

Unit TestsFailed

TimeTest
0 msJenkins > TestComponentScripts::test_scripts
Test failed: L"Running script simulation/components/tests/test_Foundation.js" Assertion failed: scriptInterface.LoadScript(pathname, content) Test failed: L"Running script simulation/components/tests/test_Gate.js"
0 msJenkins > cxxtest-debug-gcc7.xml::[failed-to-read]
Failed to read test report file /zpool0/trunk/cxxtest-debug-gcc7.xml org.dom4j.DocumentException: Error on line 1 of document : Content is not allowed in prolog. at org.dom4j.io.SAXReader.read(SAXReader.java:511)
0 msJenkins > cxxtest-debug.xml::[failed-to-read]
Failed to read test report file /Users/wfg/Jenkins/workspace/macos-differential/cxxtest-debug.xml org.dom4j.DocumentException: Error on line 1 of document : Content is not allowed in prolog. at org.dom4j.io.SAXReader.read(SAXReader.java:511)
0 msJenkins > cxxtest_debug.xml::[failed-to-read]
Failed to read test report file E:\Jenkins\workspace\vs2015-differential\cxxtest_debug.xml org.dom4j.DocumentException: Error on line 352 of document : Content is not allowed in trailing section. at org.dom4j.io.SAXReader.read(SAXReader.java:511)
0 msJenkins > TestAllocators::test_da
View Full Test Results (4 Failed · 681 Passed)

Event Timeline

wraitii created this revision.Nov 23 2020, 6:38 PM
Owners added a subscriber: Restricted Owners Package.Nov 23 2020, 6:38 PM

Build failure - The Moirai have given mortals hearts that can endure.

Link to build: https://jenkins.wildfiregames.com/job/docker-differential/3752/display/redirect

wraitii added inline comments.Nov 23 2020, 6:45 PM
binaries/data/mods/public/simulation/components/UnitAI.js
3424

:p

Build failure - The Moirai have given mortals hearts that can endure.

builderr-debug-macos.txt
../../../source/simulation2/scripting/JSInterface_Simulation.cpp:154:4: warning: suggest braces around initialization of subobject [-Wmissing-braces]
                        CFixedVector2D(-halfSize.X, -halfSize.Y),
                        ^~~~~~~~~~~~~~~~~~~~~~~~~~~~~~~~~~~~~~~~~
1 warning generated.
ld: warning: direct access in function 'RLMgCallback(mg_event, mg_connection*, mg_request_info const*)' from file 'obj/pyrogenesis_Debug/main.o' to global weak symbol 'std::__1::char_traits<char>::eq(char, char)' from file '../../../libraries/osx/gloox/lib/libgloox.a(clientbase.o)' means the weak symbol cannot be overridden at runtime. This was likely caused by different translation units being compiled with different visibility settings.
ld: warning: direct access in function 'RLMgCallback(mg_event, mg_connection*, mg_request_info const*)' from file 'obj/pyrogenesis_Debug/main.o' to global weak symbol 'std::__1::char_traits<char>::eq(char, char)' from file '../../../libraries/osx/gloox/lib/libgloox.a(clientbase.o)' means the weak symbol cannot be overridden at runtime. This was likely caused by different translation units being compiled with different visibility settings.
ld: warning: direct access in function 'tinygettext::POParser::parse()' from file '../../../binaries/system/libtinygettext_dbg.a(po_parser.o)' to global weak symbol 'std::__1::char_traits<char>::eq(char, char)' from file '../../../libraries/osx/gloox/lib/libgloox.a(clientbase.o)' means the weak symbol cannot be overridden at runtime. This was likely caused by different translation units being compiled with different visibility settings.
ld: warning: direct access in function 'JSI_Network::StartNetworkJoin(ScriptInterface::CmptPrivate*, CStrW const&, CStr8 const&, unsigned short, bool, CStr8 const&)' from file '../../../binaries/system/libengine_dbg.a(JSInterface_Network.o)' to global weak symbol 'std::__1::char_traits<char>::eq(char, char)' from file '../../../libraries/osx/gloox/lib/libgloox.a(clientbase.o)' means the weak symbol cannot be overridden at runtime. This was likely caused by different translation units being compiled with different visibility settings.
ld: warning: direct access in function 'CStr8::Find(CStr8 const&) const' from file '../../../binaries/system/libengine_dbg.a(CStr.o)' to global weak symbol 'std::__1::char_traits<char>::eq(char, char)' from file '../../../libraries/osx/gloox/lib/libgloox.a(clientbase.o)' means the weak symbol cannot be overridden at runtime. This was likely caused by different translation units being compiled with different visibility settings.
ld: warning: direct access in function 'CStr8::ReverseFind(CStr8 const&) const' from file '../../../binaries/system/libengine_dbg.a(CStr.o)' to global weak symbol 'std::__1::char_traits<char>::eq(char, char)' from file '../../../libraries/osx/gloox/lib/libgloox.a(clientbase.o)' means the weak symbol cannot be overridden at runtime. This was likely caused by different translation units being compiled with different visibility settings.
ld: warning: direct access in function 'CStr8::AfterLast(CStr8 const&, unsigned long) const' from file '../../../binaries/system/libengine_dbg.a(CStr.o)' to global weak symbol 'std::__1::char_traits<char>::eq(char, char)' from file '../../../libraries/osx/gloox/lib/libgloox.a(clientbase.o)' means the weak symbol cannot be overridden at runtime. This was likely caused by different translation units being compiled with different visibility settings.
ld: warning: direct access in function 'CStr8::BeforeLast(CStr8 const&, unsigned long) const' from file '../../../binaries/system/libengine_dbg.a(CStr.o)' to global weak symbol 'std::__1::char_traits<char>::eq(char, char)' from file '../../../libraries/osx/gloox/lib/libgloox.a(clientbase.o)' means the weak symbol cannot be overridden at runtime. This was likely caused by different translation units being compiled with different visibility settings.
ld: warning: direct access in function 'CStr8::AfterFirst(CStr8 const&, unsigned long) const' from file '../../../binaries/system/libengine_dbg.a(CStr.o)' to global weak symbol 'std::__1::char_traits<char>::eq(char, char)' from file '../../../libraries/osx/gloox/lib/libgloox.a(clientbase.o)' means the weak symbol cannot be overridden at runtime. This was likely caused by different translation units being compiled with different visibility settings.
ld: warning: direct access in function 'CStr8::BeforeFirst(CStr8 const&, unsigned long) const' from file '../../../binaries/system/libengine_dbg.a(CStr.o)' to global weak symbol 'std::__1::char_traits<char>::eq(char, char)' from file '../../../libraries/osx/gloox/lib/libgloox.a(clientbase.o)' means the weak symbol cannot be overridden at runtime. This was likely caused by different translation units being compiled with different visibility settings.
ld: warning: direct access in function 'CStr8::Remove(CStr8 const&)' from file '../../../binaries/system/libengine_dbg.a(CStr.o)' to global weak symbol 'std::__1::char_traits<char>::eq(char, char)' from file '../../../libraries/osx/gloox/lib/libgloox.a(clientbase.o)' means the weak symbol cannot be overridden at runtime. This was likely caused by different translation units being compiled with different visibility settings.
ld: warning: direct access in function 'CStr8::Replace(CStr8 const&, CStr8 const&)' from file '../../../binaries/system/libengine_dbg.a(CStr.o)' to global weak symbol 'std::__1::char_traits<char>::eq(char, char)' from file '../../../libraries/osx/gloox/lib/libgloox.a(clientbase.o)' means the weak symbol cannot be overridden at runtime. This was likely caused by different translation units being compiled with different visibility settings.
ld: warning: direct access in function 'CTemplateLoader::LoadTemplateFile(std::__1::basic_string<char, std::__1::char_traits<char>, std::__1::allocator<char> > const&, int)' from file '../../../binaries/system/libengine_dbg.a(TemplateLoader.o)' to global weak symbol 'std::__1::char_traits<char>::eq(char, char)' from file '../../../libraries/osx/gloox/lib/libgloox.a(clientbase.o)' means the weak symbol cannot be overridden at runtime. This was likely caused by different translation units being compiled with different visibility settings.
ld: warning: direct access in function 'SplitExts(char const*)' from file '../../../binaries/system/libengine_dbg.a(Util.o)' to global weak symbol 'std::__1::char_traits<char>::eq(char, char)' from file '../../../libraries/osx/gloox/lib/libgloox.a(clientbase.o)' means the weak symbol cannot be overridden at runtime. This was likely caused by different translation units being compiled with different visibility settings.
ld: warning: direct access in function 'SplitExts(char const*)' from file '../../../binaries/system/libengine_dbg.a(Util.o)' to global weak symbol 'std::__1::char_traits<char>::eq(char, char)' from file '../../../libraries/osx/gloox/lib/libgloox.a(clientbase.o)' means the weak symbol cannot be overridden at runtime. This was likely caused by different translation units being compiled with different visibility settings.
ld: warning: direct access in function 'COList::HandleAdditionalChildren(XMBElement const&, CXeromyces*)' from file '../../../binaries/system/libgui_dbg.a(COList.o)' to global weak symbol 'std::__1::char_traits<char>::eq(char, char)' from file '../../../libraries/osx/gloox/lib/libgloox.a(clientbase.o)' means the weak symbol cannot be overridden at runtime. This was likely caused by different translation units being compiled with different visibility settings.
In file included from ../../../source/graphics/tests/test_Camera.cpp:17:
/Users/wfg/Jenkins/workspace/macos-differential/source/graphics/tests/test_Camera.h:168:4: warning: suggest braces around initialization of subobject [-Wmissing-braces]
                        CVector3D(-101.0f, -101.0f, 101.0f),
                        ^~~~~~~~~~~~~~~~~~~~~~~~~~~~~~~~~~~~
1 warning generated.
In file included from ../../../source/simulation2/tests/test_SerializeTemplates.cpp:17:
/Users/wfg/Jenkins/workspace/macos-differential/source/simulation2/tests/test_SerializeTemplates.h:39:4: warning: suggest braces around initialization of subobject [-Wmissing-braces]
                        3, 0, 1, 4, 1, 5
                        ^~~~~~~~~~~~~~~~
                        {               }
1 warning generated.
ld: warning: direct access in function 'TestCLogger::ParseOutput()' from file 'obj/test_Debug/test_CLogger.o' to global weak symbol 'std::__1::char_traits<char>::eq(char, char)' from file '../../../libraries/osx/gloox/lib/libgloox.a(clientbase.o)' means the weak symbol cannot be overridden at runtime. This was likely caused by different translation units being compiled with different visibility settings.
ld: warning: direct access in function 'CxxTest::XmlFormatter::enterSuite(CxxTest::SuiteDescription const&)' from file 'obj/test_Debug/test_root.o' to global weak symbol 'std::__1::char_traits<char>::eq(char, char)' from file '../../../libraries/osx/gloox/lib/libgloox.a(clientbase.o)' means the weak symbol cannot be overridden at runtime. This was likely caused by different translation units being compiled with different visibility settings.
ld: warning: direct access in function 'ts_str_contains(std::__1::basic_string<char, std::__1::char_traits<char>, std::__1::allocator<char> > const&, std::__1::basic_string<char, std::__1::char_traits<char>, std::__1::allocator<char> > const&)' from file 'obj/test_Debug/test_setup.o' to global weak symbol 'std::__1::char_traits<char>::eq(char, char)' from file '../../../libraries/osx/gloox/lib/libgloox.a(clientbase.o)' means the weak symbol cannot be overridden at runtime. This was likely caused by different translation units being compiled with different visibility settings.
ld: warning: direct access in function 'tinygettext::POParser::parse()' from file '../../../binaries/system/libtinygettext_dbg.a(po_parser.o)' to global weak symbol 'std::__1::char_traits<char>::eq(char, char)' from file '../../../libraries/osx/gloox/lib/libgloox.a(clientbase.o)' means the weak symbol cannot be overridden at runtime. This was likely caused by different translation units being compiled with different visibility settings.
ld: warning: direct access in function 'JSI_Network::StartNetworkJoin(ScriptInterface::CmptPrivate*, CStrW const&, CStr8 const&, unsigned short, bool, CStr8 const&)' from file '../../../binaries/system/libengine_dbg.a(JSInterface_Network.o)' to global weak symbol 'std::__1::char_traits<char>::eq(char, char)' from file '../../../libraries/osx/gloox/lib/libgloox.a(clientbase.o)' means the weak symbol cannot be overridden at runtime. This was likely caused by different translation units being compiled with different visibility settings.
ld: warning: direct access in function 'CStr8::Find(CStr8 const&) const' from file '../../../binaries/system/libengine_dbg.a(CStr.o)' to global weak symbol 'std::__1::char_traits<char>::eq(char, char)' from file '../../../libraries/osx/gloox/lib/libgloox.a(clientbase.o)' means the weak symbol cannot be overridden at runtime. This was likely caused by different translation units being compiled with different visibility settings.
ld: warning: direct access in function 'CStr8::ReverseFind(CStr8 const&) const' from file '../../../binaries/system/libengine_dbg.a(CStr.o)' to global weak symbol 'std::__1::char_traits<char>::eq(char, char)' from file '../../../libraries/osx/gloox/lib/libgloox.a(clientbase.o)' means the weak symbol cannot be overridden at runtime. This was likely caused by different translation units being compiled with different visibility settings.
ld: warning: direct access in function 'CStr8::AfterLast(CStr8 const&, unsigned long) const' from file '../../../binaries/system/libengine_dbg.a(CStr.o)' to global weak symbol 'std::__1::char_traits<char>::eq(char, char)' from file '../../../libraries/osx/gloox/lib/libgloox.a(clientbase.o)' means the weak symbol cannot be overridden at runtime. This was likely caused by different translation units being compiled with different visibility settings.
ld: warning: direct access in function 'CStr8::BeforeLast(CStr8 const&, unsigned long) const' from file '../../../binaries/system/libengine_dbg.a(CStr.o)' to global weak symbol 'std::__1::char_traits<char>::eq(char, char)' from file '../../../libraries/osx/gloox/lib/libgloox.a(clientbase.o)' means the weak symbol cannot be overridden at runtime. This was likely caused by different translation units being compiled with different visibility settings.
ld: warning: direct access in function 'CStr8::AfterFirst(CStr8 const&, unsigned long) const' from file '../../../binaries/system/libengine_dbg.a(CStr.o)' to global weak symbol 'std::__1::char_traits<char>::eq(char, char)' from file '../../../libraries/osx/gloox/lib/libgloox.a(clientbase.o)' means the weak symbol cannot be overridden at runtime. This was likely caused by different translation units being compiled with different visibility settings.
ld: warning: direct access in function 'CStr8::BeforeFirst(CStr8 const&, unsigned long) const' from file '../../../binaries/system/libengine_dbg.a(CStr.o)' to global weak symbol 'std::__1::char_traits<char>::eq(char, char)' from file '../../../libraries/osx/gloox/lib/libgloox.a(clientbase.o)' means the weak symbol cannot be overridden at runtime. This was likely caused by different translation units being compiled with different visibility settings.
ld: warning: direct access in function 'CStr8::Remove(CStr8 const&)' from file '../../../binaries/system/libengine_dbg.a(CStr.o)' to global weak symbol 'std::__1::char_traits<char>::eq(char, char)' from file '../../../libraries/osx/gloox/lib/libgloox.a(clientbase.o)' means the weak symbol cannot be overridden at runtime. This was likely caused by different translation units being compiled with different visibility settings.
ld: warning: direct access in function 'CStr8::Replace(CStr8 const&, CStr8 const&)' from file '../../../binaries/system/libengine_dbg.a(CStr.o)' to global weak symbol 'std::__1::char_traits<char>::eq(char, char)' from file '../../../libraries/osx/gloox/lib/libgloox.a(clientbase.o)' means the weak symbol cannot be overridden at runtime. This was likely caused by different translation units being compiled with different visibility settings.
ld: warning: direct access in function 'CTemplateLoader::LoadTemplateFile(std::__1::basic_string<char, std::__1::char_traits<char>, std::__1::allocator<char> > const&, int)' from file '../../../binaries/system/libengine_dbg.a(TemplateLoader.o)' to global weak symbol 'std::__1::char_traits<char>::eq(char, char)' from file '../../../libraries/osx/gloox/lib/libgloox.a(clientbase.o)' means the weak symbol cannot be overridden at runtime. This was likely caused by different translation units being compiled with different visibility settings.
ld: warning: direct access in function 'SplitExts(char const*)' from file '../../../binaries/system/libengine_dbg.a(Util.o)' to global weak symbol 'std::__1::char_traits<char>::eq(char, char)' from file '../../../libraries/osx/gloox/lib/libgloox.a(clientbase.o)' means the weak symbol cannot be overridden at runtime. This was likely caused by different translation units being compiled with different visibility settings.
ld: warning: direct access in function 'SplitExts(char const*)' from file '../../../binaries/system/libengine_dbg.a(Util.o)' to global weak symbol 'std::__1::char_traits<char>::eq(char, char)' from file '../../../libraries/osx/gloox/lib/libgloox.a(clientbase.o)' means the weak symbol cannot be overridden at runtime. This was likely caused by different translation units being compiled with different visibility settings.
ld: warning: direct access in function 'COList::HandleAdditionalChildren(XMBElement const&, CXeromyces*)' from file '../../../binaries/system/libgui_dbg.a(COList.o)' to global weak symbol 'std::__1::char_traits<char>::eq(char, char)' from file '../../../libraries/osx/gloox/lib/libgloox.a(clientbase.o)' means the weak symbol cannot be overridden at runtime. This was likely caused by different translation units being compiled with different visibility settings.

Link to build: https://jenkins.wildfiregames.com/job/macos-differential/2095/display/redirect

Build failure - The Moirai have given mortals hearts that can endure.

Link to build: https://jenkins.wildfiregames.com/job/vs2015-differential/3195/display/redirect

wraitii requested review of this revision.Nov 23 2020, 6:58 PM

There seems to be some magic here that I don't understand. Need to look more into it,,,

binaries/data/mods/public/simulation/components/GarrisonHolder.js
251

Why did you need to move this? It seems wrong to have it after the message.

wraitii added inline comments.Nov 26 2020, 12:04 PM
binaries/data/mods/public/simulation/components/GarrisonHolder.js
251

Basically because it doesn't work.
UnitAI.Ungarrison calls "SetImmobile(false)", which ought to reset gates, but since at this point the turret holder hasn't yet given back the obstruction flags to the entity (that's in the message), gates don't work.

those that are deleted on construction (and don't block movement), and those that block foundations in the first place

It looks to me the trees in Delenda Est do not fall in these categories, they block movement and are deleted upon construction. Would that break hereafter?

those that are deleted on construction (and don't block movement), and those that block foundations in the first place

It looks to me the trees in Delenda Est do not fall in these categories, they block movement and are deleted upon construction. Would that break hereafter?

I don't think so, the parenthesis more reflected the state of things in 0 A.D.
Laying down a foundation is still driven by "BlockFoundation", it's only the actual construction that would now take the "block movement" flag into account, but anything that's deleted on construction should be gone by then.

wraitii updated this revision to Diff 14520.Dec 10 2020, 9:01 AM

Cleanup.

Build failure - The Moirai have given mortals hearts that can endure.

builderr-debug-macos.txt
/Applications/Xcode.app/Contents/Developer/Toolchains/XcodeDefault.xctoolchain/usr/bin/ranlib: file: ../../../binaries/system/libsimulation2_dbg.a(precompiled.o) has no symbols
/Applications/Xcode.app/Contents/Developer/Toolchains/XcodeDefault.xctoolchain/usr/bin/ranlib: file: ../../../binaries/system/libengine_dbg.a(precompiled.o) has no symbols
/Applications/Xcode.app/Contents/Developer/Toolchains/XcodeDefault.xctoolchain/usr/bin/ranlib: file: ../../../binaries/system/libgraphics_dbg.a(precompiled.o) has no symbols
/Applications/Xcode.app/Contents/Developer/Toolchains/XcodeDefault.xctoolchain/usr/bin/ranlib: file: ../../../binaries/system/libatlas_dbg.a(precompiled.o) has no symbols
ld: warning: text-based stub file /System/Library/Frameworks//CoreAudio.framework/CoreAudio.tbd and library file /System/Library/Frameworks//CoreAudio.framework/CoreAudio are out of sync. Falling back to library file for linking.
ld: warning: text-based stub file /System/Library/Frameworks//AudioToolbox.framework/AudioToolbox.tbd and library file /System/Library/Frameworks//AudioToolbox.framework/AudioToolbox are out of sync. Falling back to library file for linking.
ld: warning: text-based stub file /System/Library/Frameworks//ForceFeedback.framework/ForceFeedback.tbd and library file /System/Library/Frameworks//ForceFeedback.framework/ForceFeedback are out of sync. Falling back to library file for linking.
ld: warning: text-based stub file /System/Library/Frameworks//CoreVideo.framework/CoreVideo.tbd and library file /System/Library/Frameworks//CoreVideo.framework/CoreVideo are out of sync. Falling back to library file for linking.
ld: warning: text-based stub file /System/Library/Frameworks//Cocoa.framework/Cocoa.tbd and library file /System/Library/Frameworks//Cocoa.framework/Cocoa are out of sync. Falling back to library file for linking.
ld: warning: text-based stub file /System/Library/Frameworks//IOKit.framework/IOKit.tbd and library file /System/Library/Frameworks//IOKit.framework/IOKit are out of sync. Falling back to library file for linking.
ld: warning: text-based stub file /System/Library/Frameworks//QuartzCore.framework/QuartzCore.tbd and library file /System/Library/Frameworks//QuartzCore.framework/QuartzCore are out of sync. Falling back to library file for linking.
ld: warning: text-based stub file /System/Library/Frameworks//Metal.framework/Metal.tbd and library file /System/Library/Frameworks//Metal.framework/Metal are out of sync. Falling back to library file for linking.
ld: warning: text-based stub file /System/Library/Frameworks//OpenGL.framework/OpenGL.tbd and library file /System/Library/Frameworks//OpenGL.framework/OpenGL are out of sync. Falling back to library file for linking.
ld: warning: text-based stub file /System/Library/Frameworks//Security.framework/Security.tbd and library file /System/Library/Frameworks//Security.framework/Security are out of sync. Falling back to library file for linking.
ld: warning: text-based stub file /System/Library/Frameworks//OpenAL.framework/OpenAL.tbd and library file /System/Library/Frameworks//OpenAL.framework/OpenAL are out of sync. Falling back to library file for linking.
ld: warning: text-based stub file /System/Library/Frameworks//ApplicationServices.framework/ApplicationServices.tbd and library file /System/Library/Frameworks//ApplicationServices.framework/ApplicationServices are out of sync. Falling back to library file for linking.
ld: warning: text-based stub file /System/Library/Frameworks//Cocoa.framework/Cocoa.tbd and library file /System/Library/Frameworks//Cocoa.framework/Cocoa are out of sync. Falling back to library file for linking.
ld: warning: text-based stub file /System/Library/Frameworks//CoreFoundation.framework/CoreFoundation.tbd and library file /System/Library/Frameworks//CoreFoundation.framework/CoreFoundation are out of sync. Falling back to library file for linking.
ld: warning: text-based stub file /System/Library/Frameworks//AppKit.framework/Versions/C/AppKit.tbd and library file /System/Library/Frameworks//AppKit.framework/Versions/C/AppKit are out of sync. Falling back to library file for linking.
ld: warning: text-based stub file /System/Library/Frameworks//CoreData.framework/Versions/A/CoreData.tbd and library file /System/Library/Frameworks//CoreData.framework/Versions/A/CoreData are out of sync. Falling back to library file for linking.
ld: warning: text-based stub file /System/Library/Frameworks/Carbon.framework/Versions/A/Frameworks/CommonPanels.framework/Versions/A/CommonPanels.tbd and library file /System/Library/Frameworks/Carbon.framework/Versions/A/Frameworks/CommonPanels.framework/Versions/A/CommonPanels are out of sync. Falling back to library file for linking.
ld: warning: text-based stub file /System/Library/Frameworks/Carbon.framework/Versions/A/Frameworks/HIToolbox.framework/Versions/A/HIToolbox.tbd and library file /System/Library/Frameworks/Carbon.framework/Versions/A/Frameworks/HIToolbox.framework/Versions/A/HIToolbox are out of sync. Falling back to library file for linking.
ld: warning: text-based stub file /System/Library/Frameworks/Carbon.framework/Versions/A/Frameworks/Help.framework/Versions/A/Help.tbd and library file /System/Library/Frameworks/Carbon.framework/Versions/A/Frameworks/Help.framework/Versions/A/Help are out of sync. Falling back to library file for linking.
ld: warning: text-based stub file /System/Library/Frameworks/Carbon.framework/Versions/A/Frameworks/ImageCapture.framework/Versions/A/ImageCapture.tbd and library file /System/Library/Frameworks/Carbon.framework/Versions/A/Frameworks/ImageCapture.framework/Versions/A/ImageCapture are out of sync. Falling back to library file for linking.
ld: warning: text-based stub file /System/Library/Frameworks/Carbon.framework/Versions/A/Frameworks/Ink.framework/Versions/A/Ink.tbd and library file /System/Library/Frameworks/Carbon.framework/Versions/A/Frameworks/Ink.framework/Versions/A/Ink are out of sync. Falling back to library file for linking.
ld: warning: text-based stub file /System/Library/Frameworks/Carbon.framework/Versions/A/Frameworks/OpenScripting.framework/Versions/A/OpenScripting.tbd and library file /System/Library/Frameworks/Carbon.framework/Versions/A/Frameworks/OpenScripting.framework/Versions/A/OpenScripting are out of sync. Falling back to library file for linking.
ld: warning: text-based stub file /System/Library/Frameworks/Carbon.framework/Versions/A/Frameworks/Print.framework/Versions/A/Print.tbd and library file /System/Library/Frameworks/Carbon.framework/Versions/A/Frameworks/Print.framework/Versions/A/Print are out of sync. Falling back to library file for linking.
ld: warning: text-based stub file /System/Library/Frameworks/Carbon.framework/Versions/A/Frameworks/SecurityHI.framework/Versions/A/SecurityHI.tbd and library file /System/Library/Frameworks/Carbon.framework/Versions/A/Frameworks/SecurityHI.framework/Versions/A/SecurityHI are out of sync. Falling back to library file for linking.
ld: warning: text-based stub file /System/Library/Frameworks/Carbon.framework/Versions/A/Frameworks/SpeechRecognition.framework/Versions/A/SpeechRecognition.tbd and library file /System/Library/Frameworks/Carbon.framework/Versions/A/Frameworks/SpeechRecognition.framework/Versions/A/SpeechRecognition are out of sync. Falling back to library file for linking.
ld: warning: text-based stub file /System/Library/Frameworks//CoreImage.framework/Versions/A/CoreImage.tbd and library file /System/Library/Frameworks//CoreImage.framework/Versions/A/CoreImage are out of sync. Falling back to library file for linking.
ld: warning: text-based stub file /System/Library/Frameworks/OpenGL.framework/Versions/A/Libraries/libGLU.tbd and library file /System/Library/Frameworks/OpenGL.framework/Versions/A/Libraries/libGLU.dylib are out of sync. Falling back to library file for linking.
ld: warning: text-based stub file /System/Library/Frameworks/OpenGL.framework/Versions/A/Libraries/libGL.tbd and library file /System/Library/Frameworks/OpenGL.framework/Versions/A/Libraries/libGL.dylib are out of sync. Falling back to library file for linking.
ld: warning: text-based stub file /System/Library/Frameworks//CoreGraphics.framework/Versions/A/CoreGraphics.tbd and library file /System/Library/Frameworks//CoreGraphics.framework/Versions/A/CoreGraphics are out of sync. Falling back to library file for linking.
ld: warning: text-based stub file /System/Library/Frameworks//CoreText.framework/Versions/A/CoreText.tbd and library file /System/Library/Frameworks//CoreText.framework/Versions/A/CoreText are out of sync. Falling back to library file for linking.
ld: warning: text-based stub file /System/Library/Frameworks//ImageIO.framework/Versions/A/ImageIO.tbd and library file /System/Library/Frameworks//ImageIO.framework/Versions/A/ImageIO are out of sync. Falling back to library file for linking.
ld: warning: text-based stub file /System/Library/Frameworks//ColorSync.framework/Versions/A/ColorSync.tbd and library file /System/Library/Frameworks//ColorSync.framework/Versions/A/ColorSync are out of sync. Falling back to library file for linking.
ld: warning: text-based stub file /System/Library/Frameworks/ApplicationServices.framework/Versions/A/Frameworks/ATS.framework/Versions/A/ATS.tbd and library file /System/Library/Frameworks/ApplicationServices.framework/Versions/A/Frameworks/ATS.framework/Versions/A/ATS are out of sync. Falling back to library file for linking.
ld: warning: text-based stub file /System/Library/Frameworks/ApplicationServices.framework/Versions/A/Frameworks/ColorSyncLegacy.framework/Versions/A/ColorSyncLegacy.tbd and library file /System/Library/Frameworks/ApplicationServices.framework/Versions/A/Frameworks/ColorSyncLegacy.framework/Versions/A/ColorSyncLegacy are out of sync. Falling back to library file for linking.
ld: warning: text-based stub file /System/Library/Frameworks//CoreServices.framework/Versions/A/CoreServices.tbd and library file /System/Library/Frameworks//CoreServices.framework/Versions/A/CoreServices are out of sync. Falling back to library file for linking.
ld: warning: text-based stub file /System/Library/Frameworks/ApplicationServices.framework/Versions/A/Frameworks/HIServices.framework/Versions/A/HIServices.tbd and library file /System/Library/Frameworks/ApplicationServices.framework/Versions/A/Frameworks/HIServices.framework/Versions/A/HIServices are out of sync. Falling back to library file for linking.
ld: warning: text-based stub file /System/Library/Frameworks/ApplicationServices.framework/Versions/A/Frameworks/LangAnalysis.framework/Versions/A/LangAnalysis.tbd and library file /System/Library/Frameworks/ApplicationServices.framework/Versions/A/Frameworks/LangAnalysis.framework/Versions/A/LangAnalysis are out of sync. Falling back to library file for linking.
ld: warning: text-based stub file /System/Library/Frameworks/ApplicationServices.framework/Versions/A/Frameworks/PrintCore.framework/Versions/A/PrintCore.tbd and library file /System/Library/Frameworks/ApplicationServices.framework/Versions/A/Frameworks/PrintCore.framework/Versions/A/PrintCore are out of sync. Falling back to library file for linking.
ld: warning: text-based stub file /System/Library/Frameworks/ApplicationServices.framework/Versions/A/Frameworks/QD.framework/Versions/A/QD.tbd and library file /System/Library/Frameworks/ApplicationServices.framework/Versions/A/Frameworks/QD.framework/Versions/A/QD are out of sync. Falling back to library file for linking.
ld: warning: text-based stub file /System/Library/Frameworks/ApplicationServices.framework/Versions/A/Frameworks/SpeechSynthesis.framework/Versions/A/SpeechSynthesis.tbd and library file /System/Library/Frameworks/ApplicationServices.framework/Versions/A/Frameworks/SpeechSynthesis.framework/Versions/A/SpeechSynthesis are out of sync. Falling back to library file for linking.
ld: warning: text-based stub file /System/Library/PrivateFrameworks/UIFoundation.framework/Versions/A/UIFoundation.tbd and library file /System/Library/PrivateFrameworks/UIFoundation.framework/Versions/A/UIFoundation are out of sync. Falling back to library file for linking.
ld: warning: text-based stub file /System/Library/Frameworks//Foundation.framework/Versions/C/Foundation.tbd and library file /System/Library/Frameworks//Foundation.framework/Versions/C/Foundation are out of sync. Falling back to library file for linking.
ld: warning: text-based stub file /System/Library/Frameworks//CFNetwork.framework/Versions/A/CFNetwork.tbd and library file /System/Library/Frameworks//CFNetwork.framework/Versions/A/CFNetwork are out of sync. Falling back to library file for linking.
ld: warning: text-based stub file /System/Library/Frameworks/CoreServices.framework/Versions/A/Frameworks/FSEvents.framework/Versions/A/FSEvents.tbd and library file /System/Library/Frameworks/CoreServices.framework/Versions/A/Frameworks/FSEvents.framework/Versions/A/FSEvents are out of sync. Falling back to library file for linking.
ld: warning: text-based stub file /System/Library/Frameworks/CoreServices.framework/Versions/A/Frameworks/CarbonCore.framework/Versions/A/CarbonCore.tbd and library file /System/Library/Frameworks/CoreServices.framework/Versions/A/Frameworks/CarbonCore.framework/Versions/A/CarbonCore are out of sync. Falling back to library file for linking.
ld: warning: text-based stub file /System/Library/Frameworks/CoreServices.framework/Versions/A/Frameworks/Metadata.framework/Versions/A/Metadata.tbd and library file /System/Library/Frameworks/CoreServices.framework/Versions/A/Frameworks/Metadata.framework/Versions/A/Metadata are out of sync. Falling back to library file for linking.
ld: warning: text-based stub file /System/Library/Frameworks/CoreServices.framework/Versions/A/Frameworks/OSServices.framework/Versions/A/OSServices.tbd and library file /System/Library/Frameworks/CoreServices.framework/Versions/A/Frameworks/OSServices.framework/Versions/A/OSServices are out of sync. Falling back to library file for linking.
ld: warning: text-based stub file /System/Library/Frameworks/CoreServices.framework/Versions/A/Frameworks/SearchKit.framework/Versions/A/SearchKit.tbd and library file /System/Library/Frameworks/CoreServices.framework/Versions/A/Frameworks/SearchKit.framework/Versions/A/SearchKit are out of sync. Falling back to library file for linking.
ld: warning: text-based stub file /System/Library/Frameworks/CoreServices.framework/Versions/A/Frameworks/AE.framework/Versions/A/AE.tbd and library file /System/Library/Frameworks/CoreServices.framework/Versions/A/Frameworks/AE.framework/Versions/A/AE are out of sync. Falling back to library file for linking.
ld: warning: text-based stub file /System/Library/Frameworks/CoreServices.framework/Versions/A/Frameworks/LaunchServices.framework/Versions/A/LaunchServices.tbd and library file /System/Library/Frameworks/CoreServices.framework/Versions/A/Frameworks/LaunchServices.framework/Versions/A/LaunchServices are out of sync. Falling back to library file for linking.
ld: warning: text-based stub file /System/Library/Frameworks/CoreServices.framework/Versions/A/Frameworks/DictionaryServices.framework/Versions/A/DictionaryServices.tbd and library file /System/Library/Frameworks/CoreServices.framework/Versions/A/Frameworks/DictionaryServices.framework/Versions/A/DictionaryServices are out of sync. Falling back to library file for linking.
ld: warning: text-based stub file /System/Library/Frameworks/CoreServices.framework/Versions/A/Frameworks/SharedFileList.framework/Versions/A/SharedFileList.tbd and library file /System/Library/Frameworks/CoreServices.framework/Versions/A/Frameworks/SharedFileList.framework/Versions/A/SharedFileList are out of sync. Falling back to library file for linking.
ld: warning: object file (../../../libraries/osx/fmt/lib/libfmt.a(format.cc.o)) was built for newer OSX version (10.13) than being linked (10.12)
ld: warning: text-based stub file /System/Library/Frameworks//CoreFoundation.framework/CoreFoundation.tbd and library file /System/Library/Frameworks//CoreFoundation.framework/CoreFoundation are out of sync. Falling back to library file for linking.
In file included from ../../../source/tools/atlas/AtlasUI/ScenarioEditor/Sections/Map/Map.cpp:23:
In file included from ../../../source/tools/atlas/AtlasObject/JSONSpiritInclude.h:32:
In file included from ../../../source/third_party/jsonspirit/json_spirit_writer_template.h:13:
../../../source/third_party/jsonspirit/json_spirit_value.h:587:24: warning: 'static' function 'value_type_to_string' declared in header file should be declared 'static inline' [-Wunneeded-internal-declaration]
    static std::string value_type_to_string( const Value_type vtype )
                       ^
In file included from ../../../source/tools/atlas/AtlasUI/ScenarioEditor/Sections/Map/Map.cpp:23:
In file included from ../../../source/tools/atlas/AtlasObject/JSONSpiritInclude.h:32:
../../../source/third_party/jsonspirit/json_spirit_writer_template.h:37:50: warning: unused typedef 'Char_type' [-Wunused-local-typedef]
        typedef typename String_type::value_type Char_type;
                                                 ^
2 warnings generated.
ld: warning: text-based stub file /System/Library/Frameworks//CoreAudio.framework/CoreAudio.tbd and library file /System/Library/Frameworks//CoreAudio.framework/CoreAudio are out of sync. Falling back to library file for linking.
ld: warning: text-based stub file /System/Library/Frameworks//ForceFeedback.framework/ForceFeedback.tbd and library file /System/Library/Frameworks//ForceFeedback.framework/ForceFeedback are out of sync. Falling back to library file for linking.
ld: warning: text-based stub file /System/Library/Frameworks//CoreVideo.framework/CoreVideo.tbd and library file /System/Library/Frameworks//CoreVideo.framework/CoreVideo are out of sync. Falling back to library file for linking.
ld: warning: text-based stub file /System/Library/Frameworks//QuartzCore.framework/QuartzCore.tbd and library file /System/Library/Frameworks//QuartzCore.framework/QuartzCore are out of sync. Falling back to library file for linking.
ld: warning: text-based stub file /System/Library/Frameworks//Metal.framework/Metal.tbd and library file /System/Library/Frameworks//Metal.framework/Metal are out of sync. Falling back to library file for linking.
ld: warning: text-based stub file /System/Library/Frameworks//IOKit.framework/IOKit.tbd and library file /System/Library/Frameworks//IOKit.framework/IOKit are out of sync. Falling back to library file for linking.
ld: warning: text-based stub file /System/Library/Frameworks//Cocoa.framework/Cocoa.tbd and library file /System/Library/Frameworks//Cocoa.framework/Cocoa are out of sync. Falling back to library file for linking.
ld: warning: text-based stub file /System/Library/Frameworks//AudioToolbox.framework/AudioToolbox.tbd and library file /System/Library/Frameworks//AudioToolbox.framework/AudioToolbox are out of sync. Falling back to library file for linking.
ld: warning: text-based stub file /System/Library/Frameworks//OpenGL.framework/OpenGL.tbd and library file /System/Library/Frameworks//OpenGL.framework/OpenGL are out of sync. Falling back to library file for linking.
ld: warning: text-based stub file /System/Library/Frameworks//AGL.framework/AGL.tbd and library file /System/Library/Frameworks//AGL.framework/AGL are out of sync. Falling back to library file for linking.
ld: warning: text-based stub file /System/Library/Frameworks//CoreImage.framework/Versions/A/CoreImage.tbd and library file /System/Library/Frameworks//CoreImage.framework/Versions/A/CoreImage are out of sync. Falling back to library file for linking.
ld: warning: text-based stub file /System/Library/Frameworks//ApplicationServices.framework/Versions/A/ApplicationServices.tbd and library file /System/Library/Frameworks//ApplicationServices.framework/Versions/A/ApplicationServices are out of sync. Falling back to library file for linking.
ld: warning: text-based stub file /System/Library/Frameworks/Carbon.framework/Versions/A/Frameworks/CommonPanels.framework/Versions/A/CommonPanels.tbd and library file /System/Library/Frameworks/Carbon.framework/Versions/A/Frameworks/CommonPanels.framework/Versions/A/CommonPanels are out of sync. Falling back to library file for linking.
ld: warning: text-based stub file /System/Library/Frameworks/Carbon.framework/Versions/A/Frameworks/HIToolbox.framework/Versions/A/HIToolbox.tbd and library file /System/Library/Frameworks/Carbon.framework/Versions/A/Frameworks/HIToolbox.framework/Versions/A/HIToolbox are out of sync. Falling back to library file for linking.
ld: warning: text-based stub file /System/Library/Frameworks/Carbon.framework/Versions/A/Frameworks/Help.framework/Versions/A/Help.tbd and library file /System/Library/Frameworks/Carbon.framework/Versions/A/Frameworks/Help.framework/Versions/A/Help are out of sync. Falling back to library file for linking.
ld: warning: text-based stub file /System/Library/Frameworks/Carbon.framework/Versions/A/Frameworks/ImageCapture.framework/Versions/A/ImageCapture.tbd and library file /System/Library/Frameworks/Carbon.framework/Versions/A/Frameworks/ImageCapture.framework/Versions/A/ImageCapture are out of sync. Falling back to library file for linking.
ld: warning: text-based stub file /System/Library/Frameworks/Carbon.framework/Versions/A/Frameworks/Ink.framework/Versions/A/Ink.tbd and library file /System/Library/Frameworks/Carbon.framework/Versions/A/Frameworks/Ink.framework/Versions/A/Ink are out of sync. Falling back to library file for linking.
ld: warning: text-based stub file /System/Library/Frameworks/Carbon.framework/Versions/A/Frameworks/OpenScripting.framework/Versions/A/OpenScripting.tbd and library file /System/Library/Frameworks/Carbon.framework/Versions/A/Frameworks/OpenScripting.framework/Versions/A/OpenScripting are out of sync. Falling back to library file for linking.
ld: warning: text-based stub file /System/Library/Frameworks/Carbon.framework/Versions/A/Frameworks/Print.framework/Versions/A/Print.tbd and library file /System/Library/Frameworks/Carbon.framework/Versions/A/Frameworks/Print.framework/Versions/A/Print are out of sync. Falling back to library file for linking.
ld: warning: text-based stub file /System/Library/Frameworks/Carbon.framework/Versions/A/Frameworks/SecurityHI.framework/Versions/A/SecurityHI.tbd and library file /System/Library/Frameworks/Carbon.framework/Versions/A/Frameworks/SecurityHI.framework/Versions/A/SecurityHI are out of sync. Falling back to library file for linking.
ld: warning: text-based stub file /System/Library/Frameworks/Carbon.framework/Versions/A/Frameworks/SpeechRecognition.framework/Versions/A/SpeechRecognition.tbd and library file /System/Library/Frameworks/Carbon.framework/Versions/A/Frameworks/SpeechRecognition.framework/Versions/A/SpeechRecognition are out of sync. Falling back to library file for linking.
ld: warning: text-based stub file /System/Library/Frameworks//AppKit.framework/Versions/C/AppKit.tbd and library file /System/Library/Frameworks//AppKit.framework/Versions/C/AppKit are out of sync. Falling back to library file for linking.
ld: warning: text-based stub file /System/Library/Frameworks//CoreData.framework/Versions/A/CoreData.tbd and library file /System/Library/Frameworks//CoreData.framework/Versions/A/CoreData are out of sync. Falling back to library file for linking.
ld: warning: text-based stub file /System/Library/Frameworks/OpenGL.framework/Versions/A/Libraries/libGLU.tbd and library file /System/Library/Frameworks/OpenGL.framework/Versions/A/Libraries/libGLU.dylib are out of sync. Falling back to library file for linking.
ld: warning: text-based stub file /System/Library/Frameworks/OpenGL.framework/Versions/A/Libraries/libGL.tbd and library file /System/Library/Frameworks/OpenGL.framework/Versions/A/Libraries/libGL.dylib are out of sync. Falling back to library file for linking.
ld: warning: text-based stub file /System/Library/Frameworks//CoreGraphics.framework/Versions/A/CoreGraphics.tbd and library file /System/Library/Frameworks//CoreGraphics.framework/Versions/A/CoreGraphics are out of sync. Falling back to library file for linking.
ld: warning: text-based stub file /System/Library/Frameworks//CoreText.framework/Versions/A/CoreText.tbd and library file /System/Library/Frameworks//CoreText.framework/Versions/A/CoreText are out of sync. Falling back to library file for linking.
ld: warning: text-based stub file /System/Library/Frameworks//ImageIO.framework/Versions/A/ImageIO.tbd and library file /System/Library/Frameworks//ImageIO.framework/Versions/A/ImageIO are out of sync. Falling back to library file for linking.
ld: warning: text-based stub file /System/Library/Frameworks//ColorSync.framework/Versions/A/ColorSync.tbd and library file /System/Library/Frameworks//ColorSync.framework/Versions/A/ColorSync are out of sync. Falling back to library file for linking.
ld: warning: text-based stub file /System/Library/Frameworks/ApplicationServices.framework/Versions/A/Frameworks/ATS.framework/Versions/A/ATS.tbd and library file /System/Library/Frameworks/ApplicationServices.framework/Versions/A/Frameworks/ATS.framework/Versions/A/ATS are out of sync. Falling back to library file for linking.
ld: warning: text-based stub file /System/Library/Frameworks/ApplicationServices.framework/Versions/A/Frameworks/ColorSyncLegacy.framework/Versions/A/ColorSyncLegacy.tbd and library file /System/Library/Frameworks/ApplicationServices.framework/Versions/A/Frameworks/ColorSyncLegacy.framework/Versions/A/ColorSyncLegacy are out of sync. Falling back to library file for linking.
ld: warning: text-based stub file /System/Library/Frameworks//CoreServices.framework/Versions/A/CoreServices.tbd and library file /System/Library/Frameworks//CoreServices.framework/Versions/A/CoreServices are out of sync. Falling back to library file for linking.
ld: warning: text-based stub file /System/Library/Frameworks/ApplicationServices.framework/Versions/A/Frameworks/HIServices.framework/Versions/A/HIServices.tbd and library file /System/Library/Frameworks/ApplicationServices.framework/Versions/A/Frameworks/HIServices.framework/Versions/A/HIServices are out of sync. Falling back to library file for linking.
ld: warning: text-based stub file /System/Library/Frameworks/ApplicationServices.framework/Versions/A/Frameworks/LangAnalysis.framework/Versions/A/LangAnalysis.tbd and library file /System/Library/Frameworks/ApplicationServices.framework/Versions/A/Frameworks/LangAnalysis.framework/Versions/A/LangAnalysis are out of sync. Falling back to library file for linking.
ld: warning: text-based stub file /System/Library/Frameworks/ApplicationServices.framework/Versions/A/Frameworks/PrintCore.framework/Versions/A/PrintCore.tbd and library file /System/Library/Frameworks/ApplicationServices.framework/Versions/A/Frameworks/PrintCore.framework/Versions/A/PrintCore are out of sync. Falling back to library file for linking.
ld: warning: text-based stub file /System/Library/Frameworks/ApplicationServices.framework/Versions/A/Frameworks/QD.framework/Versions/A/QD.tbd and library file /System/Library/Frameworks/ApplicationServices.framework/Versions/A/Frameworks/QD.framework/Versions/A/QD are out of sync. Falling back to library file for linking.
ld: warning: text-based stub file /System/Library/Frameworks/ApplicationServices.framework/Versions/A/Frameworks/SpeechSynthesis.framework/Versions/A/SpeechSynthesis.tbd and library file /System/Library/Frameworks/ApplicationServices.framework/Versions/A/Frameworks/SpeechSynthesis.framework/Versions/A/SpeechSynthesis are out of sync. Falling back to library file for linking.
ld: warning: text-based stub file /System/Library/PrivateFrameworks/UIFoundation.framework/Versions/A/UIFoundation.tbd and library file /System/Library/PrivateFrameworks/UIFoundation.framework/Versions/A/UIFoundation are out of sync. Falling back to library file for linking.
ld: warning: text-based stub file /System/Library/Frameworks//Foundation.framework/Versions/C/Foundation.tbd and library file /System/Library/Frameworks//Foundation.framework/Versions/C/Foundation are out of sync. Falling back to library file for linking.
ld: warning: text-based stub file /System/Library/Frameworks//CFNetwork.framework/Versions/A/CFNetwork.tbd and library file /System/Library/Frameworks//CFNetwork.framework/Versions/A/CFNetwork are out of sync. Falling back to library file for linking.
ld: warning: text-based stub file /System/Library/Frameworks/CoreServices.framework/Versions/A/Frameworks/FSEvents.framework/Versions/A/FSEvents.tbd and library file /System/Library/Frameworks/CoreServices.framework/Versions/A/Frameworks/FSEvents.framework/Versions/A/FSEvents are out of sync. Falling back to library file for linking.
ld: warning: text-based stub file /System/Library/Frameworks/CoreServices.framework/Versions/A/Frameworks/CarbonCore.framework/Versions/A/CarbonCore.tbd and library file /System/Library/Frameworks/CoreServices.framework/Versions/A/Frameworks/CarbonCore.framework/Versions/A/CarbonCore are out of sync. Falling back to library file for linking.
ld: warning: text-based stub file /System/Library/Frameworks/CoreServices.framework/Versions/A/Frameworks/Metadata.framework/Versions/A/Metadata.tbd and library file /System/Library/Frameworks/CoreServices.framework/Versions/A/Frameworks/Metadata.framework/Versions/A/Metadata are out of sync. Falling back to library file for linking.
ld: warning: text-based stub file /System/Library/Frameworks/CoreServices.framework/Versions/A/Frameworks/OSServices.framework/Versions/A/OSServices.tbd and library file /System/Library/Frameworks/CoreServices.framework/Versions/A/Frameworks/OSServices.framework/Versions/A/OSServices are out of sync. Falling back to library file for linking.
ld: warning: text-based stub file /System/Library/Frameworks/CoreServices.framework/Versions/A/Frameworks/SearchKit.framework/Versions/A/SearchKit.tbd and library file /System/Library/Frameworks/CoreServices.framework/Versions/A/Frameworks/SearchKit.framework/Versions/A/SearchKit are out of sync. Falling back to library file for linking.
ld: warning: text-based stub file /System/Library/Frameworks//CoreFoundation.framework/Versions/A/CoreFoundation.tbd and library file /System/Library/Frameworks//CoreFoundation.framework/Versions/A/CoreFoundation are out of sync. Falling back to library file for linking.
ld: warning: text-based stub file /System/Library/Frameworks/CoreServices.framework/Versions/A/Frameworks/AE.framework/Versions/A/AE.tbd and library file /System/Library/Frameworks/CoreServices.framework/Versions/A/Frameworks/AE.framework/Versions/A/AE are out of sync. Falling back to library file for linking.
ld: warning: text-based stub file /System/Library/Frameworks/CoreServices.framework/Versions/A/Frameworks/LaunchServices.framework/Versions/A/LaunchServices.tbd and library file /System/Library/Frameworks/CoreServices.framework/Versions/A/Frameworks/LaunchServices.framework/Versions/A/LaunchServices are out of sync. Falling back to library file for linking.
ld: warning: text-based stub file /System/Library/Frameworks/CoreServices.framework/Versions/A/Frameworks/DictionaryServices.framework/Versions/A/DictionaryServices.tbd and library file /System/Library/Frameworks/CoreServices.framework/Versions/A/Frameworks/DictionaryServices.framework/Versions/A/DictionaryServices are out of sync. Falling back to library file for linking.
ld: warning: text-based stub file /System/Library/Frameworks/CoreServices.framework/Versions/A/Frameworks/SharedFileList.framework/Versions/A/SharedFileList.tbd and library file /System/Library/Frameworks/CoreServices.framework/Versions/A/Frameworks/SharedFileList.framework/Versions/A/SharedFileList are out of sync. Falling back to library file for linking.
ld: warning: direct access in function 'wxNavigationEnabled<wxWindow>::wxNavigationEnabled()' from file 'obj/AtlasUI_Debug/ActorEditor.o' to global weak symbol 'wxNavigationEnabled<wxWindow>::OnChildFocus(wxChildFocusEvent&)' from file '/Users/wfg/Jenkins/workspace/macos-differential/libraries/osx/wxwidgets/lib/libwx_osx_cocoau_core-3.0.a(corelib_busyinfo.o)' means the weak symbol cannot be overridden at runtime. This was likely caused by different translation units being compiled with different visibility settings.
ld: warning: direct access in function 'wxNavigationEnabled<wxWindow>::wxNavigationEnabled()' from file 'obj/AtlasUI_Debug/ActorEditor.o' to global weak symbol 'wxNavigationEnabled<wxWindow>::OnFocus(wxFocusEvent&)' from file '/Users/wfg/Jenkins/workspace/macos-differential/libraries/osx/wxwidgets/lib/libwx_osx_cocoau_core-3.0.a(corelib_busyinfo.o)' means the weak symbol cannot be overridden at runtime. This was likely caused by different translation units being compiled with different visibility settings.
ld: warning: direct access in function 'wxNavigationEnabled<wxWindow>::wxNavigationEnabled()' from file 'obj/AtlasUI_Debug/ActorEditor.o' to global weak symbol 'wxNavigationEnabled<wxWindow>::OnNavigationKey(wxNavigationKeyEvent&)' from file '/Users/wfg/Jenkins/workspace/macos-differential/libraries/osx/wxwidgets/lib/libwx_osx_cocoau_core-3.0.a(corelib_busyinfo.o)' means the weak symbol cannot be overridden at runtime. This was likely caused by different translation units being compiled with different visibility settings.
ld: warning: direct access in function 'wxStringToStringHashMap_wxImplementation_HashTable::clear()' from file 'obj/AtlasUI_Debug/ActorEditor.o' to global weak symbol 'wxStringToStringHashMap_wxImplementation_HashTable::DeleteNode(_wxHashTable_NodeBase*)' from file '/Users/wfg/Jenkins/workspace/macos-differential/libraries/osx/wxwidgets/lib/libwx_baseu-3.0.a(baselib_appbase.o)' means the weak symbol cannot be overridden at runtime. This was likely caused by different translation units being compiled with different visibility settings.
ld: warning: direct access in function 'wxStringToNumHashMap_wxImplementation_HashTable::clear()' from file 'obj/AtlasUI_Debug/ActorEditor.o' to global weak symbol 'wxStringToNumHashMap_wxImplementation_HashTable::DeleteNode(_wxHashTable_NodeBase*)' from file '/Users/wfg/Jenkins/workspace/macos-differential/libraries/osx/wxwidgets/lib/libwx_baseu-3.0.a(baselib_appbase.o)' means the weak symbol cannot be overridden at runtime. This was likely caused by different translation units being compiled with different visibility settings.
ld: warning: direct access in function 'wxNavigationEnabled<wxListCtrlBase>::wxNavigationEnabled()' from file 'obj/AtlasUI_Debug/EditableListCtrl.o' to global weak symbol 'wxNavigationEnabled<wxListCtrlBase>::OnChildFocus(wxChildFocusEvent&)' from file '/Users/wfg/Jenkins/workspace/macos-differential/libraries/osx/wxwidgets/lib/libwx_osx_cocoau_core-3.0.a(corelib_listctrlcmn.o)' means the weak symbol cannot be overridden at runtime. This was likely caused by different translation units being compiled with different visibility settings.
ld: warning: direct access in function 'wxNavigationEnabled<wxListCtrlBase>::wxNavigationEnabled()' from file 'obj/AtlasUI_Debug/EditableListCtrl.o' to global weak symbol 'wxNavigationEnabled<wxListCtrlBase>::OnFocus(wxFocusEvent&)' from file '/Users/wfg/Jenkins/workspace/macos-differential/libraries/osx/wxwidgets/lib/libwx_osx_cocoau_core-3.0.a(corelib_listctrlcmn.o)' means the weak symbol cannot be overridden at runtime. This was likely caused by different translation units being compiled with different visibility settings.
ld: warning: direct access in function 'wxNavigationEnabled<wxListCtrlBase>::wxNavigationEnabled()' from file 'obj/AtlasUI_Debug/EditableListCtrl.o' to global weak symbol 'wxNavigationEnabled<wxListCtrlBase>::OnNavigationKey(wxNavigationKeyEvent&)' from file '/Users/wfg/Jenkins/workspace/macos-differential/libraries/osx/wxwidgets/lib/libwx_osx_cocoau_core-3.0.a(corelib_listctrlcmn.o)' means the weak symbol cannot be overridden at runtime. This was likely caused by different translation units being compiled with different visibility settings.
ld: warning: direct access in function 'wxNavigationEnabled<wxCompositeWindow<wxSpinCtrlBase> >::wxNavigationEnabled()' from file 'obj/AtlasUI_Debug/Player.o' to global weak symbol 'wxNavigationEnabled<wxCompositeWindow<wxSpinCtrlBase> >::OnChildFocus(wxChildFocusEvent&)' from file '/Users/wfg/Jenkins/workspace/macos-differential/libraries/osx/wxwidgets/lib/libwx_osx_cocoau_core-3.0.a(corelib_spinctlg.o)' means the weak symbol cannot be overridden at runtime. This was likely caused by different translation units being compiled with different visibility settings.
ld: warning: direct access in function 'wxNavigationEnabled<wxCompositeWindow<wxSpinCtrlBase> >::wxNavigationEnabled()' from file 'obj/AtlasUI_Debug/Player.o' to global weak symbol 'wxNavigationEnabled<wxCompositeWindow<wxSpinCtrlBase> >::OnFocus(wxFocusEvent&)' from file '/Users/wfg/Jenkins/workspace/macos-differential/libraries/osx/wxwidgets/lib/libwx_osx_cocoau_core-3.0.a(corelib_spinctlg.o)' means the weak symbol cannot be overridden at runtime. This was likely caused by different translation units being compiled with different visibility settings.
ld: warning: direct access in function 'wxNavigationEnabled<wxCompositeWindow<wxSpinCtrlBase> >::wxNavigationEnabled()' from file 'obj/AtlasUI_Debug/Player.o' to global weak symbol 'wxNavigationEnabled<wxCompositeWindow<wxSpinCtrlBase> >::OnNavigationKey(wxNavigationKeyEvent&)' from file '/Users/wfg/Jenkins/workspace/macos-differential/libraries/osx/wxwidgets/lib/libwx_osx_cocoau_core-3.0.a(corelib_spinctlg.o)' means the weak symbol cannot be overridden at runtime. This was likely caused by different translation units being compiled with different visibility settings.
ld: warning: direct access in function 'wxCompositeWindow<wxSpinCtrlBase>::wxCompositeWindow()' from file 'obj/AtlasUI_Debug/Player.o' to global weak symbol 'wxCompositeWindow<wxSpinCtrlBase>::OnWindowCreate(wxWindowCreateEvent&)' from file '/Users/wfg/Jenkins/workspace/macos-differential/libraries/osx/wxwidgets/lib/libwx_osx_cocoau_core-3.0.a(corelib_spinctlg.o)' means the weak symbol cannot be overridden at runtime. This was likely caused by different translation units being compiled with different visibility settings.
ld: warning: direct access in function 'wxNavigationEnabled<wxBookCtrlBase>::wxNavigationEnabled()' from file 'obj/AtlasUI_Debug/Player.o' to global weak symbol 'wxNavigationEnabled<wxBookCtrlBase>::OnChildFocus(wxChildFocusEvent&)' from file '/Users/wfg/Jenkins/workspace/macos-differential/libraries/osx/wxwidgets/lib/libwx_osx_cocoau_core-3.0.a(corelib_choicbkg.o)' means the weak symbol cannot be overridden at runtime. This was likely caused by different translation units being compiled with different visibility settings.
ld: warning: direct access in function 'wxNavigationEnabled<wxBookCtrlBase>::wxNavigationEnabled()' from file 'obj/AtlasUI_Debug/Player.o' to global weak symbol 'wxNavigationEnabled<wxBookCtrlBase>::OnFocus(wxFocusEvent&)' from file '/Users/wfg/Jenkins/workspace/macos-differential/libraries/osx/wxwidgets/lib/libwx_osx_cocoau_core-3.0.a(corelib_choicbkg.o)' means the weak symbol cannot be overridden at runtime. This was likely caused by different translation units being compiled with different visibility settings.
ld: warning: direct access in function 'wxNavigationEnabled<wxBookCtrlBase>::wxNavigationEnabled()' from file 'obj/AtlasUI_Debug/Player.o' to global weak symbol 'wxNavigationEnabled<wxBookCtrlBase>::OnNavigationKey(wxNavigationKeyEvent&)' from file '/Users/wfg/Jenkins/workspace/macos-differential/libraries/osx/wxwidgets/lib/libwx_osx_cocoau_core-3.0.a(corelib_choicbkg.o)' means the weak symbol cannot be overridden at runtime. This was likely caused by different translation units being compiled with different visibility settings.
ld: warning: text-based stub file /System/Library/Frameworks//CoreAudio.framework/CoreAudio.tbd and library file /System/Library/Frameworks//CoreAudio.framework/CoreAudio are out of sync. Falling back to library file for linking.
ld: warning: text-based stub file /System/Library/Frameworks//AudioToolbox.framework/AudioToolbox.tbd and library file /System/Library/Frameworks//AudioToolbox.framework/AudioToolbox are out of sync. Falling back to library file for linking.
ld: warning: text-based stub file /System/Library/Frameworks//ForceFeedback.framework/ForceFeedback.tbd and library file /System/Library/Frameworks//ForceFeedback.framework/ForceFeedback are out of sync. Falling back to library file for linking.
ld: warning: text-based stub file /System/Library/Frameworks//CoreVideo.framework/CoreVideo.tbd and library file /System/Library/Frameworks//CoreVideo.framework/CoreVideo are out of sync. Falling back to library file for linking.
ld: warning: text-based stub file /System/Library/Frameworks//Cocoa.framework/Cocoa.tbd and library file /System/Library/Frameworks//Cocoa.framework/Cocoa are out of sync. Falling back to library file for linking.
ld: warning: text-based stub file /System/Library/Frameworks//IOKit.framework/IOKit.tbd and library file /System/Library/Frameworks//IOKit.framework/IOKit are out of sync. Falling back to library file for linking.
ld: warning: text-based stub file /System/Library/Frameworks//QuartzCore.framework/QuartzCore.tbd and library file /System/Library/Frameworks//QuartzCore.framework/QuartzCore are out of sync. Falling back to library file for linking.
ld: warning: text-based stub file /System/Library/Frameworks//Metal.framework/Metal.tbd and library file /System/Library/Frameworks//Metal.framework/Metal are out of sync. Falling back to library file for linking.
ld: warning: text-based stub file /System/Library/Frameworks//OpenGL.framework/OpenGL.tbd and library file /System/Library/Frameworks//OpenGL.framework/OpenGL are out of sync. Falling back to library file for linking.
ld: warning: text-based stub file /System/Library/Frameworks//Security.framework/Security.tbd and library file /System/Library/Frameworks//Security.framework/Security are out of sync. Falling back to library file for linking.
ld: warning: text-based stub file /System/Library/Frameworks//OpenAL.framework/OpenAL.tbd and library file /System/Library/Frameworks//OpenAL.framework/OpenAL are out of sync. Falling back to library file for linking.
ld: warning: text-based stub file /System/Library/Frameworks//CoreImage.framework/Versions/A/CoreImage.tbd and library file /System/Library/Frameworks//CoreImage.framework/Versions/A/CoreImage are out of sync. Falling back to library file for linking.
ld: warning: text-based stub file /System/Library/Frameworks//AppKit.framework/Versions/C/AppKit.tbd and library file /System/Library/Frameworks//AppKit.framework/Versions/C/AppKit are out of sync. Falling back to library file for linking.
ld: warning: text-based stub file /System/Library/Frameworks//CoreData.framework/Versions/A/CoreData.tbd and library file /System/Library/Frameworks//CoreData.framework/Versions/A/CoreData are out of sync. Falling back to library file for linking.
ld: warning: text-based stub file /System/Library/Frameworks//ApplicationServices.framework/Versions/A/ApplicationServices.tbd and library file /System/Library/Frameworks//ApplicationServices.framework/Versions/A/ApplicationServices are out of sync. Falling back to library file for linking.
ld: warning: text-based stub file /System/Library/Frameworks/Carbon.framework/Versions/A/Frameworks/CommonPanels.framework/Versions/A/CommonPanels.tbd and library file /System/Library/Frameworks/Carbon.framework/Versions/A/Frameworks/CommonPanels.framework/Versions/A/CommonPanels are out of sync. Falling back to library file for linking.
ld: warning: text-based stub file /System/Library/Frameworks/Carbon.framework/Versions/A/Frameworks/HIToolbox.framework/Versions/A/HIToolbox.tbd and library file /System/Library/Frameworks/Carbon.framework/Versions/A/Frameworks/HIToolbox.framework/Versions/A/HIToolbox are out of sync. Falling back to library file for linking.
ld: warning: text-based stub file /System/Library/Frameworks/Carbon.framework/Versions/A/Frameworks/Help.framework/Versions/A/Help.tbd and library file /System/Library/Frameworks/Carbon.framework/Versions/A/Frameworks/Help.framework/Versions/A/Help are out of sync. Falling back to library file for linking.
ld: warning: text-based stub file /System/Library/Frameworks/Carbon.framework/Versions/A/Frameworks/ImageCapture.framework/Versions/A/ImageCapture.tbd and library file /System/Library/Frameworks/Carbon.framework/Versions/A/Frameworks/ImageCapture.framework/Versions/A/ImageCapture are out of sync. Falling back to library file for linking.
ld: warning: text-based stub file /System/Library/Frameworks/Carbon.framework/Versions/A/Frameworks/Ink.framework/Versions/A/Ink.tbd and library file /System/Library/Frameworks/Carbon.framework/Versions/A/Frameworks/Ink.framework/Versions/A/Ink are out of sync. Falling back to library file for linking.
ld: warning: text-based stub file /System/Library/Frameworks/Carbon.framework/Versions/A/Frameworks/OpenScripting.framework/Versions/A/OpenScripting.tbd and library file /System/Library/Frameworks/Carbon.framework/Versions/A/Frameworks/OpenScripting.framework/Versions/A/OpenScripting are out of sync. Falling back to library file for linking.
ld: warning: text-based stub file /System/Library/Frameworks/Carbon.framework/Versions/A/Frameworks/Print.framework/Versions/A/Print.tbd and library file /System/Library/Frameworks/Carbon.framework/Versions/A/Frameworks/Print.framework/Versions/A/Print are out of sync. Falling back to library file for linking.
ld: warning: text-based stub file /System/Library/Frameworks/Carbon.framework/Versions/A/Frameworks/SecurityHI.framework/Versions/A/SecurityHI.tbd and library file /System/Library/Frameworks/Carbon.framework/Versions/A/Frameworks/SecurityHI.framework/Versions/A/SecurityHI are out of sync. Falling back to library file for linking.
ld: warning: text-based stub file /System/Library/Frameworks/Carbon.framework/Versions/A/Frameworks/SpeechRecognition.framework/Versions/A/SpeechRecognition.tbd and library file /System/Library/Frameworks/Carbon.framework/Versions/A/Frameworks/SpeechRecognition.framework/Versions/A/SpeechRecognition are out of sync. Falling back to library file for linking.
ld: warning: text-based stub file /System/Library/Frameworks/OpenGL.framework/Versions/A/Libraries/libGLU.tbd and library file /System/Library/Frameworks/OpenGL.framework/Versions/A/Libraries/libGLU.dylib are out of sync. Falling back to library file for linking.
ld: warning: text-based stub file /System/Library/Frameworks/OpenGL.framework/Versions/A/Libraries/libGL.tbd and library file /System/Library/Frameworks/OpenGL.framework/Versions/A/Libraries/libGL.dylib are out of sync. Falling back to library file for linking.
ld: warning: text-based stub file /System/Library/PrivateFrameworks/UIFoundation.framework/Versions/A/UIFoundation.tbd and library file /System/Library/PrivateFrameworks/UIFoundation.framework/Versions/A/UIFoundation are out of sync. Falling back to library file for linking.
ld: warning: text-based stub file /System/Library/Frameworks//Foundation.framework/Versions/C/Foundation.tbd and library file /System/Library/Frameworks//Foundation.framework/Versions/C/Foundation are out of sync. Falling back to library file for linking.
ld: warning: text-based stub file /System/Library/Frameworks//CoreGraphics.framework/Versions/A/CoreGraphics.tbd and library file /System/Library/Frameworks//CoreGraphics.framework/Versions/A/CoreGraphics are out of sync. Falling back to library file for linking.
ld: warning: text-based stub file /System/Library/Frameworks//CoreText.framework/Versions/A/CoreText.tbd and library file /System/Library/Frameworks//CoreText.framework/Versions/A/CoreText are out of sync. Falling back to library file for linking.
ld: warning: text-based stub file /System/Library/Frameworks//ImageIO.framework/Versions/A/ImageIO.tbd and library file /System/Library/Frameworks//ImageIO.framework/Versions/A/ImageIO are out of sync. Falling back to library file for linking.
ld: warning: text-based stub file /System/Library/Frameworks//ColorSync.framework/Versions/A/ColorSync.tbd and library file /System/Library/Frameworks//ColorSync.framework/Versions/A/ColorSync are out of sync. Falling back to library file for linking.
ld: warning: text-based stub file /System/Library/Frameworks/ApplicationServices.framework/Versions/A/Frameworks/ATS.framework/Versions/A/ATS.tbd and library file /System/Library/Frameworks/ApplicationServices.framework/Versions/A/Frameworks/ATS.framework/Versions/A/ATS are out of sync. Falling back to library file for linking.
ld: warning: text-based stub file /System/Library/Frameworks/ApplicationServices.framework/Versions/A/Frameworks/ColorSyncLegacy.framework/Versions/A/ColorSyncLegacy.tbd and library file /System/Library/Frameworks/ApplicationServices.framework/Versions/A/Frameworks/ColorSyncLegacy.framework/Versions/A/ColorSyncLegacy are out of sync. Falling back to library file for linking.
ld: warning: text-based stub file /System/Library/Frameworks//CoreServices.framework/Versions/A/CoreServices.tbd and library file /System/Library/Frameworks//CoreServices.framework/Versions/A/CoreServices are out of sync. Falling back to library file for linking.
ld: warning: text-based stub file /System/Library/Frameworks/ApplicationServices.framework/Versions/A/Frameworks/HIServices.framework/Versions/A/HIServices.tbd and library file /System/Library/Frameworks/ApplicationServices.framework/Versions/A/Frameworks/HIServices.framework/Versions/A/HIServices are out of sync. Falling back to library file for linking.
ld: warning: text-based stub file /System/Library/Frameworks/ApplicationServices.framework/Versions/A/Frameworks/LangAnalysis.framework/Versions/A/LangAnalysis.tbd and library file /System/Library/Frameworks/ApplicationServices.framework/Versions/A/Frameworks/LangAnalysis.framework/Versions/A/LangAnalysis are out of sync. Falling back to library file for linking.
ld: warning: text-based stub file /System/Library/Frameworks/ApplicationServices.framework/Versions/A/Frameworks/PrintCore.framework/Versions/A/PrintCore.tbd and library file /System/Library/Frameworks/ApplicationServices.framework/Versions/A/Frameworks/PrintCore.framework/Versions/A/PrintCore are out of sync. Falling back to library file for linking.
ld: warning: text-based stub file /System/Library/Frameworks/ApplicationServices.framework/Versions/A/Frameworks/QD.framework/Versions/A/QD.tbd and library file /System/Library/Frameworks/ApplicationServices.framework/Versions/A/Frameworks/QD.framework/Versions/A/QD are out of sync. Falling back to library file for linking.
ld: warning: text-based stub file /System/Library/Frameworks/ApplicationServices.framework/Versions/A/Frameworks/SpeechSynthesis.framework/Versions/A/SpeechSynthesis.tbd and library file /System/Library/Frameworks/ApplicationServices.framework/Versions/A/Frameworks/SpeechSynthesis.framework/Versions/A/SpeechSynthesis are out of sync. Falling back to library file for linking.
ld: warning: text-based stub file /System/Library/Frameworks//CoreFoundation.framework/Versions/A/CoreFoundation.tbd and library file /System/Library/Frameworks//CoreFoundation.framework/Versions/A/CoreFoundation are out of sync. Falling back to library file for linking.
ld: warning: text-based stub file /System/Library/Frameworks//CFNetwork.framework/Versions/A/CFNetwork.tbd and library file /System/Library/Frameworks//CFNetwork.framework/Versions/A/CFNetwork are out of sync. Falling back to library file for linking.
ld: warning: text-based stub file /System/Library/Frameworks/CoreServices.framework/Versions/A/Frameworks/FSEvents.framework/Versions/A/FSEvents.tbd and library file /System/Library/Frameworks/CoreServices.framework/Versions/A/Frameworks/FSEvents.framework/Versions/A/FSEvents are out of sync. Falling back to library file for linking.
ld: warning: text-based stub file /System/Library/Frameworks/CoreServices.framework/Versions/A/Frameworks/CarbonCore.framework/Versions/A/CarbonCore.tbd and library file /System/Library/Frameworks/CoreServices.framework/Versions/A/Frameworks/CarbonCore.framework/Versions/A/CarbonCore are out of sync. Falling back to library file for linking.
ld: warning: text-based stub file /System/Library/Frameworks/CoreServices.framework/Versions/A/Frameworks/Metadata.framework/Versions/A/Metadata.tbd and library file /System/Library/Frameworks/CoreServices.framework/Versions/A/Frameworks/Metadata.framework/Versions/A/Metadata are out of sync. Falling back to library file for linking.
ld: warning: text-based stub file /System/Library/Frameworks/CoreServices.framework/Versions/A/Frameworks/OSServices.framework/Versions/A/OSServices.tbd and library file /System/Library/Frameworks/CoreServices.framework/Versions/A/Frameworks/OSServices.framework/Versions/A/OSServices are out of sync. Falling back to library file for linking.
ld: warning: text-based stub file /System/Library/Frameworks/CoreServices.framework/Versions/A/Frameworks/SearchKit.framework/Versions/A/SearchKit.tbd and library file /System/Library/Frameworks/CoreServices.framework/Versions/A/Frameworks/SearchKit.framework/Versions/A/SearchKit are out of sync. Falling back to library file for linking.
ld: warning: text-based stub file /System/Library/Frameworks/CoreServices.framework/Versions/A/Frameworks/AE.framework/Versions/A/AE.tbd and library file /System/Library/Frameworks/CoreServices.framework/Versions/A/Frameworks/AE.framework/Versions/A/AE are out of sync. Falling back to library file for linking.
ld: warning: text-based stub file /System/Library/Frameworks/CoreServices.framework/Versions/A/Frameworks/LaunchServices.framework/Versions/A/LaunchServices.tbd and library file /System/Library/Frameworks/CoreServices.framework/Versions/A/Frameworks/LaunchServices.framework/Versions/A/LaunchServices are out of sync. Falling back to library file for linking.
ld: warning: text-based stub file /System/Library/Frameworks/CoreServices.framework/Versions/A/Frameworks/DictionaryServices.framework/Versions/A/DictionaryServices.tbd and library file /System/Library/Frameworks/CoreServices.framework/Versions/A/Frameworks/DictionaryServices.framework/Versions/A/DictionaryServices are out of sync. Falling back to library file for linking.
ld: warning: text-based stub file /System/Library/Frameworks/CoreServices.framework/Versions/A/Frameworks/SharedFileList.framework/Versions/A/SharedFileList.tbd and library file /System/Library/Frameworks/CoreServices.framework/Versions/A/Frameworks/SharedFileList.framework/Versions/A/SharedFileList are out of sync. Falling back to library file for linking.
ld: warning: object file (../../../libraries/osx/fmt/lib/libfmt.a(format.cc.o)) was built for newer OSX version (10.13) than being linked (10.12)
ld: warning: text-based stub file /System/Library/Frameworks//CoreFoundation.framework/CoreFoundation.tbd and library file /System/Library/Frameworks//CoreFoundation.framework/CoreFoundation are out of sync. Falling back to library file for linking.

Link to build: https://jenkins.wildfiregames.com/job/macos-differential/2365/display/redirect

Build failure - The Moirai have given mortals hearts that can endure.

Link to build: https://jenkins.wildfiregames.com/job/vs2015-differential/3454/display/redirect

Build failure - The Moirai have given mortals hearts that can endure.

Link to build: https://jenkins.wildfiregames.com/job/docker-differential/4025/display/redirect

Freagarach added inline comments.Dec 15 2020, 7:56 AM
binaries/data/mods/public/simulation/components/GarrisonHolder.js
251

So it seems that would be fixed by only setting Immobile to false when we actually leave the garrisoned state?

wraitii added inline comments.Dec 15 2020, 8:32 AM
binaries/data/mods/public/simulation/components/GarrisonHolder.js
251

Well, yes, but that happens on UnitAI.Ungarrison. You could listen to the message, but you have no guaranteed on order. You could have an "ungarrisoned" message, but it doesn't seem very necessary at the moment.

bb added a subscriber: bb.Dec 22 2020, 11:57 PM

The fact of the moment is that we don't really need this "block construction" flag. It's arbitrary. It's also 1-1 with "block movement" for units. So foundations can just check for units that block movements, and gates too.

Why are these the same? I see the templates have the same value for both tags, but they mean two different things. To me it sounds like a regression to remove one of them.

IsActive seems to be a wrapper around all other types. Removing means temporarily disabling the obstruction yields more code duplication, while removing some code in Obstruction. This could be considered.

binaries/data/mods/public/simulation/components/UnitAI.js
637–638

Seems sane to have these here, but why are they behing the finishOrder? So we are well in the next order and still set it?

In D3136#144000, @bb wrote:

Why are these the same? I see the templates have the same value for both tags, but they mean two different things. To me it sounds like a regression to remove one of them.

My argument in the summary is that "block construction" means" I am a unit that blocks movement". Given the places where it's used, it's not really about blocking construction, but more about being a unit, and then we need a flag for units to ignore, and that's block movement.

That being said, I can keep "block construction", but it still can only be activated for units, because of the rP21702 issue. At that point, it feels more of a hack than removing it entirely to me.

IsActive seems to be a wrapper around all other types. Removing means temporarily disabling the obstruction yields more code duplication, while removing some code in Obstruction. This could be considered.

I'm not sure what you mean.

binaries/data/mods/public/simulation/components/UnitAI.js
637–638

Mmh. FinishOrder here doesn't actually move us onto the next _state_, it just processes the order to set up the next state change, so this is probably fine.
The truth is these should probably be in the "leave" of the garrison state or not in this component at all.

I'll see if they can easily be moved above or if that breaks something.

Freagarach added inline comments.Dec 24 2020, 6:52 AM
binaries/data/mods/public/simulation/components/UnitAI.js
637–638

The truth is these should probably be in the "leave" of the garrison state.

That breaks. See D2368. I'm working towards fixing that, actually.

or not in this component at all

busy with that also ;)

wraitii planned changes to this revision.Thu, Feb 11, 10:59 AM

Changing my mind about this diff -> probably a dumb idea. "Active" should just shortcut to unset all flags in D3151, and the only really relevant cleanup is DisableBlockMovement/Pathfinding really shouldn't be schema data (foundation.js can just set it on init), but I'll do that after D3151.