Page MenuHomeWildfire Games

[WIP] Support JS promises
Needs ReviewPublic

Authored by wraitii on Apr 6 2021, 4:52 PM.
This revision needs review, but there are no reviewers specified.

Details

Reviewers
None
Summary

Javascript is single-threaded, but can support cooperative multithreading using async/await and promises.
Spidermonkey exposes bindings to allow running promises (code that currently tries to use Promises will crash).

This diff implements the necessary logic to support that, which is mostly two things:

  • A JSContext* hook to dispatch promise queuing.
  • Logic to run the dispatched jobs (aka the 'event loop').

However, doing that only allows asynchronous JS calls, which is not terribly useful by itself because everything remains single-threaded.
This diff also implements a simple interface to let JS wait on C++ threaded tasks, using the thread pool manager.

The logic is barebones and should perhaps be expended, but works. I've added fairly simple tests covering the above.
One particular inefficiency is that we iterate futures when calling RunJob, which could be inefficient if there are lots of pending futures.

Some notes:

  • RunJobs() should be run manually in any context that supports Promises - It's probably a good idea to fail queuing jobs if the scriptinterface isn't supposed to run jobs
  • The futures are passed to the script interface so that it knows to wait/cancel them when being destroyed. This looks a lot like Spidermonkey's OffThreadPromiseTask but they kind of assume JSContext lifetime. I think doing it manually is better.

WIP:

  • I think the code should be moved from ScriptInterface to a 'ScriptTasks' class somewhere, probably still owned by the scriptInterface.

Future work:

  • It would be nice to be able to run JS work in a thread manner, but that's more work.

This demonstrates a very simple one that calls the resolve job instantly when the asynchronous task ends.

Design questions:

  • Is it a good idea to support asynchronous calls from Javascript? It might well lead to unpredictable lag.
  • If so, when and where?
Test Plan

Compile, run the tests, review the implementation.

Event Timeline

wraitii created this revision.Apr 6 2021, 4:52 PM
Vulcan added a comment.Apr 6 2021, 4:54 PM

Build failure - The Moirai have given mortals hearts that can endure.

builderr-debug-macos.txt
../../../source/scriptinterface/ScriptInterface.cpp:69:65: warning: unused parameter 'promise' [-Wunused-parameter]
        virtual bool enqueuePromiseJob(JSContext* cx, JS::HandleObject promise,
                                                                       ^
../../../source/scriptinterface/ScriptInterface.cpp:71:29: warning: unused parameter 'allocationSite' [-Wunused-parameter]
                                                                   JS::HandleObject allocationSite,
                                                                                    ^
../../../source/scriptinterface/ScriptInterface.cpp:72:29: warning: unused parameter 'incumbentGlobal' [-Wunused-parameter]
                                                                   JS::HandleObject incumbentGlobal)
                                                                                    ^
../../../source/scriptinterface/ScriptInterface.cpp:84:34: warning: unused parameter 'cx' [-Wunused-parameter]
        virtual void runJobs(JSContext* cx) {};
                                        ^
../../../source/scriptinterface/ScriptInterface.cpp:97:25: warning: private field 'm_ScriptInterface' is not used [-Wunused-private-field]
        const ScriptInterface& m_ScriptInterface;
                               ^
5 warnings generated.
/Applications/Xcode.app/Contents/Developer/Toolchains/XcodeDefault.xctoolchain/usr/bin/ranlib: file: ../../../binaries/system/libscriptinterface_dbg.a(precompiled.o) has no symbols
ld: warning: text-based stub file /System/Library/Frameworks//CoreAudio.framework/CoreAudio.tbd and library file /System/Library/Frameworks//CoreAudio.framework/CoreAudio are out of sync. Falling back to library file for linking.
ld: warning: text-based stub file /System/Library/Frameworks//AudioToolbox.framework/AudioToolbox.tbd and library file /System/Library/Frameworks//AudioToolbox.framework/AudioToolbox are out of sync. Falling back to library file for linking.
ld: warning: text-based stub file /System/Library/Frameworks//ForceFeedback.framework/ForceFeedback.tbd and library file /System/Library/Frameworks//ForceFeedback.framework/ForceFeedback are out of sync. Falling back to library file for linking.
ld: warning: text-based stub file /System/Library/Frameworks//CoreVideo.framework/CoreVideo.tbd and library file /System/Library/Frameworks//CoreVideo.framework/CoreVideo are out of sync. Falling back to library file for linking.
ld: warning: text-based stub file /System/Library/Frameworks//Cocoa.framework/Cocoa.tbd and library file /System/Library/Frameworks//Cocoa.framework/Cocoa are out of sync. Falling back to library file for linking.
ld: warning: text-based stub file /System/Library/Frameworks//IOKit.framework/IOKit.tbd and library file /System/Library/Frameworks//IOKit.framework/IOKit are out of sync. Falling back to library file for linking.
ld: warning: text-based stub file /System/Library/Frameworks//QuartzCore.framework/QuartzCore.tbd and library file /System/Library/Frameworks//QuartzCore.framework/QuartzCore are out of sync. Falling back to library file for linking.
ld: warning: text-based stub file /System/Library/Frameworks//Metal.framework/Metal.tbd and library file /System/Library/Frameworks//Metal.framework/Metal are out of sync. Falling back to library file for linking.
ld: warning: text-based stub file /System/Library/Frameworks//OpenGL.framework/OpenGL.tbd and library file /System/Library/Frameworks//OpenGL.framework/OpenGL are out of sync. Falling back to library file for linking.
ld: warning: text-based stub file /System/Library/Frameworks//Security.framework/Security.tbd and library file /System/Library/Frameworks//Security.framework/Security are out of sync. Falling back to library file for linking.
ld: warning: text-based stub file /System/Library/Frameworks//OpenAL.framework/OpenAL.tbd and library file /System/Library/Frameworks//OpenAL.framework/OpenAL are out of sync. Falling back to library file for linking.
ld: warning: text-based stub file /System/Library/Frameworks//ApplicationServices.framework/ApplicationServices.tbd and library file /System/Library/Frameworks//ApplicationServices.framework/ApplicationServices are out of sync. Falling back to library file for linking.
ld: warning: text-based stub file /System/Library/Frameworks//Cocoa.framework/Cocoa.tbd and library file /System/Library/Frameworks//Cocoa.framework/Cocoa are out of sync. Falling back to library file for linking.
ld: warning: text-based stub file /System/Library/Frameworks//CoreFoundation.framework/CoreFoundation.tbd and library file /System/Library/Frameworks//CoreFoundation.framework/CoreFoundation are out of sync. Falling back to library file for linking.
ld: warning: text-based stub file /System/Library/Frameworks//AppKit.framework/Versions/C/AppKit.tbd and library file /System/Library/Frameworks//AppKit.framework/Versions/C/AppKit are out of sync. Falling back to library file for linking.
ld: warning: text-based stub file /System/Library/Frameworks//CoreData.framework/Versions/A/CoreData.tbd and library file /System/Library/Frameworks//CoreData.framework/Versions/A/CoreData are out of sync. Falling back to library file for linking.
ld: warning: text-based stub file /System/Library/Frameworks/Carbon.framework/Versions/A/Frameworks/CommonPanels.framework/Versions/A/CommonPanels.tbd and library file /System/Library/Frameworks/Carbon.framework/Versions/A/Frameworks/CommonPanels.framework/Versions/A/CommonPanels are out of sync. Falling back to library file for linking.
ld: warning: text-based stub file /System/Library/Frameworks/Carbon.framework/Versions/A/Frameworks/HIToolbox.framework/Versions/A/HIToolbox.tbd and library file /System/Library/Frameworks/Carbon.framework/Versions/A/Frameworks/HIToolbox.framework/Versions/A/HIToolbox are out of sync. Falling back to library file for linking.
ld: warning: text-based stub file /System/Library/Frameworks/Carbon.framework/Versions/A/Frameworks/Help.framework/Versions/A/Help.tbd and library file /System/Library/Frameworks/Carbon.framework/Versions/A/Frameworks/Help.framework/Versions/A/Help are out of sync. Falling back to library file for linking.
ld: warning: text-based stub file /System/Library/Frameworks/Carbon.framework/Versions/A/Frameworks/ImageCapture.framework/Versions/A/ImageCapture.tbd and library file /System/Library/Frameworks/Carbon.framework/Versions/A/Frameworks/ImageCapture.framework/Versions/A/ImageCapture are out of sync. Falling back to library file for linking.
ld: warning: text-based stub file /System/Library/Frameworks/Carbon.framework/Versions/A/Frameworks/Ink.framework/Versions/A/Ink.tbd and library file /System/Library/Frameworks/Carbon.framework/Versions/A/Frameworks/Ink.framework/Versions/A/Ink are out of sync. Falling back to library file for linking.
ld: warning: text-based stub file /System/Library/Frameworks/Carbon.framework/Versions/A/Frameworks/OpenScripting.framework/Versions/A/OpenScripting.tbd and library file /System/Library/Frameworks/Carbon.framework/Versions/A/Frameworks/OpenScripting.framework/Versions/A/OpenScripting are out of sync. Falling back to library file for linking.
ld: warning: text-based stub file /System/Library/Frameworks/Carbon.framework/Versions/A/Frameworks/Print.framework/Versions/A/Print.tbd and library file /System/Library/Frameworks/Carbon.framework/Versions/A/Frameworks/Print.framework/Versions/A/Print are out of sync. Falling back to library file for linking.
ld: warning: text-based stub file /System/Library/Frameworks/Carbon.framework/Versions/A/Frameworks/SecurityHI.framework/Versions/A/SecurityHI.tbd and library file /System/Library/Frameworks/Carbon.framework/Versions/A/Frameworks/SecurityHI.framework/Versions/A/SecurityHI are out of sync. Falling back to library file for linking.
ld: warning: text-based stub file /System/Library/Frameworks/Carbon.framework/Versions/A/Frameworks/SpeechRecognition.framework/Versions/A/SpeechRecognition.tbd and library file /System/Library/Frameworks/Carbon.framework/Versions/A/Frameworks/SpeechRecognition.framework/Versions/A/SpeechRecognition are out of sync. Falling back to library file for linking.
ld: warning: text-based stub file /System/Library/Frameworks//CoreImage.framework/Versions/A/CoreImage.tbd and library file /System/Library/Frameworks//CoreImage.framework/Versions/A/CoreImage are out of sync. Falling back to library file for linking.
ld: warning: text-based stub file /System/Library/Frameworks/OpenGL.framework/Versions/A/Libraries/libGLU.tbd and library file /System/Library/Frameworks/OpenGL.framework/Versions/A/Libraries/libGLU.dylib are out of sync. Falling back to library file for linking.
ld: warning: text-based stub file /System/Library/Frameworks/OpenGL.framework/Versions/A/Libraries/libGL.tbd and library file /System/Library/Frameworks/OpenGL.framework/Versions/A/Libraries/libGL.dylib are out of sync. Falling back to library file for linking.
ld: warning: text-based stub file /System/Library/Frameworks//CoreGraphics.framework/Versions/A/CoreGraphics.tbd and library file /System/Library/Frameworks//CoreGraphics.framework/Versions/A/CoreGraphics are out of sync. Falling back to library file for linking.
ld: warning: text-based stub file /System/Library/Frameworks//CoreText.framework/Versions/A/CoreText.tbd and library file /System/Library/Frameworks//CoreText.framework/Versions/A/CoreText are out of sync. Falling back to library file for linking.
ld: warning: text-based stub file /System/Library/Frameworks//ImageIO.framework/Versions/A/ImageIO.tbd and library file /System/Library/Frameworks//ImageIO.framework/Versions/A/ImageIO are out of sync. Falling back to library file for linking.
ld: warning: text-based stub file /System/Library/Frameworks//ColorSync.framework/Versions/A/ColorSync.tbd and library file /System/Library/Frameworks//ColorSync.framework/Versions/A/ColorSync are out of sync. Falling back to library file for linking.
ld: warning: text-based stub file /System/Library/Frameworks/ApplicationServices.framework/Versions/A/Frameworks/ATS.framework/Versions/A/ATS.tbd and library file /System/Library/Frameworks/ApplicationServices.framework/Versions/A/Frameworks/ATS.framework/Versions/A/ATS are out of sync. Falling back to library file for linking.
ld: warning: text-based stub file /System/Library/Frameworks/ApplicationServices.framework/Versions/A/Frameworks/ColorSyncLegacy.framework/Versions/A/ColorSyncLegacy.tbd and library file /System/Library/Frameworks/ApplicationServices.framework/Versions/A/Frameworks/ColorSyncLegacy.framework/Versions/A/ColorSyncLegacy are out of sync. Falling back to library file for linking.
ld: warning: text-based stub file /System/Library/Frameworks//CoreServices.framework/Versions/A/CoreServices.tbd and library file /System/Library/Frameworks//CoreServices.framework/Versions/A/CoreServices are out of sync. Falling back to library file for linking.
ld: warning: text-based stub file /System/Library/Frameworks/ApplicationServices.framework/Versions/A/Frameworks/HIServices.framework/Versions/A/HIServices.tbd and library file /System/Library/Frameworks/ApplicationServices.framework/Versions/A/Frameworks/HIServices.framework/Versions/A/HIServices are out of sync. Falling back to library file for linking.
ld: warning: text-based stub file /System/Library/Frameworks/ApplicationServices.framework/Versions/A/Frameworks/LangAnalysis.framework/Versions/A/LangAnalysis.tbd and library file /System/Library/Frameworks/ApplicationServices.framework/Versions/A/Frameworks/LangAnalysis.framework/Versions/A/LangAnalysis are out of sync. Falling back to library file for linking.
ld: warning: text-based stub file /System/Library/Frameworks/ApplicationServices.framework/Versions/A/Frameworks/PrintCore.framework/Versions/A/PrintCore.tbd and library file /System/Library/Frameworks/ApplicationServices.framework/Versions/A/Frameworks/PrintCore.framework/Versions/A/PrintCore are out of sync. Falling back to library file for linking.
ld: warning: text-based stub file /System/Library/Frameworks/ApplicationServices.framework/Versions/A/Frameworks/QD.framework/Versions/A/QD.tbd and library file /System/Library/Frameworks/ApplicationServices.framework/Versions/A/Frameworks/QD.framework/Versions/A/QD are out of sync. Falling back to library file for linking.
ld: warning: text-based stub file /System/Library/Frameworks/ApplicationServices.framework/Versions/A/Frameworks/SpeechSynthesis.framework/Versions/A/SpeechSynthesis.tbd and library file /System/Library/Frameworks/ApplicationServices.framework/Versions/A/Frameworks/SpeechSynthesis.framework/Versions/A/SpeechSynthesis are out of sync. Falling back to library file for linking.
ld: warning: text-based stub file /System/Library/PrivateFrameworks/UIFoundation.framework/Versions/A/UIFoundation.tbd and library file /System/Library/PrivateFrameworks/UIFoundation.framework/Versions/A/UIFoundation are out of sync. Falling back to library file for linking.
ld: warning: text-based stub file /System/Library/Frameworks//Foundation.framework/Versions/C/Foundation.tbd and library file /System/Library/Frameworks//Foundation.framework/Versions/C/Foundation are out of sync. Falling back to library file for linking.
ld: warning: text-based stub file /System/Library/Frameworks//CFNetwork.framework/Versions/A/CFNetwork.tbd and library file /System/Library/Frameworks//CFNetwork.framework/Versions/A/CFNetwork are out of sync. Falling back to library file for linking.
ld: warning: text-based stub file /System/Library/Frameworks/CoreServices.framework/Versions/A/Frameworks/FSEvents.framework/Versions/A/FSEvents.tbd and library file /System/Library/Frameworks/CoreServices.framework/Versions/A/Frameworks/FSEvents.framework/Versions/A/FSEvents are out of sync. Falling back to library file for linking.
ld: warning: text-based stub file /System/Library/Frameworks/CoreServices.framework/Versions/A/Frameworks/CarbonCore.framework/Versions/A/CarbonCore.tbd and library file /System/Library/Frameworks/CoreServices.framework/Versions/A/Frameworks/CarbonCore.framework/Versions/A/CarbonCore are out of sync. Falling back to library file for linking.
ld: warning: text-based stub file /System/Library/Frameworks/CoreServices.framework/Versions/A/Frameworks/Metadata.framework/Versions/A/Metadata.tbd and library file /System/Library/Frameworks/CoreServices.framework/Versions/A/Frameworks/Metadata.framework/Versions/A/Metadata are out of sync. Falling back to library file for linking.
ld: warning: text-based stub file /System/Library/Frameworks/CoreServices.framework/Versions/A/Frameworks/OSServices.framework/Versions/A/OSServices.tbd and library file /System/Library/Frameworks/CoreServices.framework/Versions/A/Frameworks/OSServices.framework/Versions/A/OSServices are out of sync. Falling back to library file for linking.
ld: warning: text-based stub file /System/Library/Frameworks/CoreServices.framework/Versions/A/Frameworks/SearchKit.framework/Versions/A/SearchKit.tbd and library file /System/Library/Frameworks/CoreServices.framework/Versions/A/Frameworks/SearchKit.framework/Versions/A/SearchKit are out of sync. Falling back to library file for linking.
ld: warning: text-based stub file /System/Library/Frameworks/CoreServices.framework/Versions/A/Frameworks/AE.framework/Versions/A/AE.tbd and library file /System/Library/Frameworks/CoreServices.framework/Versions/A/Frameworks/AE.framework/Versions/A/AE are out of sync. Falling back to library file for linking.
ld: warning: text-based stub file /System/Library/Frameworks/CoreServices.framework/Versions/A/Frameworks/LaunchServices.framework/Versions/A/LaunchServices.tbd and library file /System/Library/Frameworks/CoreServices.framework/Versions/A/Frameworks/LaunchServices.framework/Versions/A/LaunchServices are out of sync. Falling back to library file for linking.
ld: warning: text-based stub file /System/Library/Frameworks/CoreServices.framework/Versions/A/Frameworks/DictionaryServices.framework/Versions/A/DictionaryServices.tbd and library file /System/Library/Frameworks/CoreServices.framework/Versions/A/Frameworks/DictionaryServices.framework/Versions/A/DictionaryServices are out of sync. Falling back to library file for linking.
ld: warning: text-based stub file /System/Library/Frameworks/CoreServices.framework/Versions/A/Frameworks/SharedFileList.framework/Versions/A/SharedFileList.tbd and library file /System/Library/Frameworks/CoreServices.framework/Versions/A/Frameworks/SharedFileList.framework/Versions/A/SharedFileList are out of sync. Falling back to library file for linking.
ld: warning: object file (../../../libraries/osx/fmt/lib/libfmt.a(format.cc.o)) was built for newer OSX version (10.13) than being linked (10.12)
ld: warning: text-based stub file /System/Library/Frameworks//CoreFoundation.framework/CoreFoundation.tbd and library file /System/Library/Frameworks//CoreFoundation.framework/CoreFoundation are out of sync. Falling back to library file for linking.
make[1]: *** No rule to make target `/Users/wfg/Jenkins/workspace/macos-differential/build/workspaces/gcc/../../../source/simulation2/system/SimSynchronization.h', needed by `obj/test_Debug/test_Camera.o'.  Stop.
make: *** [test] Error 2

Link to build: https://jenkins.wildfiregames.com/job/macos-differential/3860/display/redirect

Vulcan added a comment.Apr 6 2021, 4:57 PM

Successful build - Chance fights ever on the side of the prudent.

Debug: 
Microsoft (R) Build Engine version 15.9.21+g9802d43bc3 for .NET Framework
Copyright (C) Microsoft Corporation. All rights reserved.

    12>e:\jenkins\workspace\vs2015-differential\libraries\source\spidermonkey\include-win32-debug\js\promise.h(255): warning C4251: 'JS::AutoDebuggerJobQueueInterruption::_mCheckNotUsedAsTemporary': class 'mozilla::detail::GuardObjectNotificationReceiver' needs to have dll-interface to be used by clients of class 'JS::AutoDebuggerJobQueueInterruption' [E:\Jenkins\workspace\vs2015-differential\build\workspaces\vs2017\scriptinterface.vcxproj]
    12>e:\jenkins\workspace\vs2015-differential\libraries\source\spidermonkey\include-win32-debug\js\promise.h(257): warning C4251: 'JS::AutoDebuggerJobQueueInterruption::saved': class 'mozilla::UniquePtr<JS::JobQueue::SavedJobQueue,JS::DeletePolicy<T>>' needs to have dll-interface to be used by clients of class 'JS::AutoDebuggerJobQueueInterruption' [E:\Jenkins\workspace\vs2015-differential\build\workspaces\vs2017\scriptinterface.vcxproj]
    12>e:\jenkins\workspace\vs2015-differential\source\scriptinterface\scriptinterface.cpp(72): warning C4100: 'incumbentGlobal': unreferenced formal parameter [E:\Jenkins\workspace\vs2015-differential\build\workspaces\vs2017\scriptinterface.vcxproj]
    12>e:\jenkins\workspace\vs2015-differential\source\scriptinterface\scriptinterface.cpp(71): warning C4100: 'allocationSite': unreferenced formal parameter [E:\Jenkins\workspace\vs2015-differential\build\workspaces\vs2017\scriptinterface.vcxproj]
    12>e:\jenkins\workspace\vs2015-differential\source\scriptinterface\scriptinterface.cpp(69): warning C4100: 'promise': unreferenced formal parameter [E:\Jenkins\workspace\vs2015-differential\build\workspaces\vs2017\scriptinterface.vcxproj]
    12>e:\jenkins\workspace\vs2015-differential\source\scriptinterface\scriptinterface.cpp(84): warning C4100: 'cx': unreferenced formal parameter [E:\Jenkins\workspace\vs2015-differential\build\workspaces\vs2017\scriptinterface.vcxproj]
Release: 
Microsoft (R) Build Engine version 15.9.21+g9802d43bc3 for .NET Framework
Copyright (C) Microsoft Corporation. All rights reserved.

    11>e:\jenkins\workspace\vs2015-differential\libraries\source\spidermonkey\include-win32-release\js\promise.h(257): warning C4251: 'JS::AutoDebuggerJobQueueInterruption::saved': class 'mozilla::UniquePtr<JS::JobQueue::SavedJobQueue,JS::DeletePolicy<T>>' needs to have dll-interface to be used by clients of class 'JS::AutoDebuggerJobQueueInterruption' [E:\Jenkins\workspace\vs2015-differential\build\workspaces\vs2017\scriptinterface.vcxproj]
    11>e:\jenkins\workspace\vs2015-differential\source\scriptinterface\scriptinterface.cpp(72): warning C4100: 'incumbentGlobal': unreferenced formal parameter [E:\Jenkins\workspace\vs2015-differential\build\workspaces\vs2017\scriptinterface.vcxproj]
    11>e:\jenkins\workspace\vs2015-differential\source\scriptinterface\scriptinterface.cpp(71): warning C4100: 'allocationSite': unreferenced formal parameter [E:\Jenkins\workspace\vs2015-differential\build\workspaces\vs2017\scriptinterface.vcxproj]
    11>e:\jenkins\workspace\vs2015-differential\source\scriptinterface\scriptinterface.cpp(69): warning C4100: 'promise': unreferenced formal parameter [E:\Jenkins\workspace\vs2015-differential\build\workspaces\vs2017\scriptinterface.vcxproj]
    11>e:\jenkins\workspace\vs2015-differential\source\scriptinterface\scriptinterface.cpp(84): warning C4100: 'cx': unreferenced formal parameter [E:\Jenkins\workspace\vs2015-differential\build\workspaces\vs2017\scriptinterface.vcxproj]

Link to build: https://jenkins.wildfiregames.com/job/vs2015-differential/4955/display/redirect

Vulcan added a comment.Apr 6 2021, 5:03 PM

Build is unstable, some tests have failed - The Moirai have given mortals hearts that can endure.

builderr-debug-gcc7.txt
../../../source/scriptinterface/ScriptInterface.cpp: In member function 'virtual bool JobQueue::enqueuePromiseJob(JSContext*, JS::HandleObject, JS::HandleObject, JS::HandleObject, JS::HandleObject)':
../../../source/scriptinterface/ScriptInterface.cpp:69:65: warning: unused parameter 'promise' [-Wunused-parameter]
  virtual bool enqueuePromiseJob(JSContext* cx, JS::HandleObject promise,
                                                ~~~~~~~~~~~~~~~~~^~~~~~~
../../../source/scriptinterface/ScriptInterface.cpp:71:29: warning: unused parameter 'allocationSite' [-Wunused-parameter]
            JS::HandleObject allocationSite,
            ~~~~~~~~~~~~~~~~~^~~~~~~~~~~~~~
../../../source/scriptinterface/ScriptInterface.cpp:72:29: warning: unused parameter 'incumbentGlobal' [-Wunused-parameter]
            JS::HandleObject incumbentGlobal)
            ~~~~~~~~~~~~~~~~~^~~~~~~~~~~~~~~
../../../source/scriptinterface/ScriptInterface.cpp: In member function 'virtual void JobQueue::runJobs(JSContext*)':
../../../source/scriptinterface/ScriptInterface.cpp:84:34: warning: unused parameter 'cx' [-Wunused-parameter]
  virtual void runJobs(JSContext* cx) {};
                       ~~~~~~~~~~~^~
builderr-release-gcc7.txt
../../../source/scriptinterface/ScriptInterface.cpp: In member function 'virtual bool JobQueue::enqueuePromiseJob(JSContext*, JS::HandleObject, JS::HandleObject, JS::HandleObject, JS::HandleObject)':
../../../source/scriptinterface/ScriptInterface.cpp:69:65: warning: unused parameter 'promise' [-Wunused-parameter]
  virtual bool enqueuePromiseJob(JSContext* cx, JS::HandleObject promise,
                                                ~~~~~~~~~~~~~~~~~^~~~~~~
../../../source/scriptinterface/ScriptInterface.cpp:71:29: warning: unused parameter 'allocationSite' [-Wunused-parameter]
            JS::HandleObject allocationSite,
            ~~~~~~~~~~~~~~~~~^~~~~~~~~~~~~~
../../../source/scriptinterface/ScriptInterface.cpp:72:29: warning: unused parameter 'incumbentGlobal' [-Wunused-parameter]
            JS::HandleObject incumbentGlobal)
            ~~~~~~~~~~~~~~~~~^~~~~~~~~~~~~~~
../../../source/scriptinterface/ScriptInterface.cpp: In member function 'virtual void JobQueue::runJobs(JSContext*)':
../../../source/scriptinterface/ScriptInterface.cpp:84:34: warning: unused parameter 'cx' [-Wunused-parameter]
  virtual void runJobs(JSContext* cx) {};
                       ~~~~~~~~~~~^~

Link to build: https://jenkins.wildfiregames.com/job/docker-differential/5569/display/redirect

wraitii requested review of this revision.Apr 6 2021, 5:03 PM
Stan added a subscriber: Stan.Apr 6 2021, 5:43 PM

The idea sounds sane, but you're right, the usage is a bit blurry for me now. Maybe something that could be exposed only to the AI due to relatively asynchronous nature of its plans?

Does it run in another thread?

I don't know much about asynchronous tasks but can it help to defer some requests like for the lobby (profiles, rankings, etc.) when bots overloaded/slowdowns and loading data which are scrollable like maps browser, mods?

lyv added a subscriber: lyv.EditedAug 15 2021, 11:19 AM

Hypothetically, if someone implemented better procedural map generation, this would be extremely beneficial.

For instance, Promise.all([placeFishInTheOcean(), placeTreesOnLand(), placeGoatsOnMountain()]).then((results) => {}); are mutually exclusive actions that can be concurrently executed if the underlying library is designed with concurrency in mind.

Since it actually is feasible to do so, seems like supporting this would also be somewhat nice.

For simulation, I am not sure since it is strictly lockstep.

For GUI, potential use cases present. Again, if it is well designed, GUI components should be more like React components, and the interface should be more like SPAs.

wraitii updated this revision to Diff 20270.May 15 2022, 11:29 AM

Rework, upgrade & make actually functional.

See summary for current status.

wraitii retitled this revision from [POC] Support JS promises to [WIP] Support JS promises.May 15 2022, 11:38 AM
wraitii edited the summary of this revision. (Show Details)
wraitii edited the test plan for this revision. (Show Details)

Build failure - The Moirai have given mortals hearts that can endure.

builderr-debug-clang7.txt
In file included from ../../../source/simulation2/components/ICmpAIInterface.cpp:22:
In file included from ../../../source/simulation2/system/InterfaceScripted.h:23:
../../../source/scriptinterface/ScriptInterface.h:218:55: error: no template named 'function' in namespace 'std'; did you mean 'fmt::internal::function'?
        void AddPromise(JS::Heap<JSObject*>& promise, Future<std::function<JS::HandleValue(const ScriptRequest&)>>&& future);
                                                             ^~~~~~~~~~~~~
                                                             fmt::internal::function
/usr/include/fmt/format.h:270:8: note: 'fmt::internal::function' declared here
struct function {
       ^
1 error generated.
make[1]: *** [simulation2.make:339: obj/simulation2_Debug/ICmpAIInterface.o] Error 1
make: *** [Makefile:109: simulation2] Error 2
builderr-debug-gcc7.txt
In file included from ../../../source/simulation2/system/InterfaceScripted.h:23,
                 from ../../../source/simulation2/components/ICmpAIInterface.cpp:22:
../../../source/scriptinterface/ScriptInterface.h:218:60: error: 'function' is not a member of 'std'
  void AddPromise(JS::Heap<JSObject*>& promise, Future<std::function<JS::HandleValue(const ScriptRequest&)>>&& future);
                                                            ^~~~~~~~
../../../source/scriptinterface/ScriptInterface.h:218:60: note: 'std::function' is defined in header '<functional>'; did you forget to '#include <functional>'?
../../../source/scriptinterface/ScriptInterface.h:30:1:
+#include <functional>
 
../../../source/scriptinterface/ScriptInterface.h:218:60:
  void AddPromise(JS::Heap<JSObject*>& promise, Future<std::function<JS::HandleValue(const ScriptRequest&)>>&& future);
                                                            ^~~~~~~~
../../../source/scriptinterface/ScriptInterface.h:218:105: error: template argument 1 is invalid
  void AddPromise(JS::Heap<JSObject*>& promise, Future<std::function<JS::HandleValue(const ScriptRequest&)>>&& future);
                                                                                                         ^
../../../source/scriptinterface/ScriptInterface.h:218:60: error: 'function' is not a member of 'std'
  void AddPromise(JS::Heap<JSObject*>& promise, Future<std::function<JS::HandleValue(const ScriptRequest&)>>&& future);
                                                            ^~~~~~~~
../../../source/scriptinterface/ScriptInterface.h:218:60: note: 'std::function' is defined in header '<functional>'; did you forget to '#include <functional>'?
../../../source/scriptinterface/ScriptInterface.h:218:106: error: template argument 1 is invalid
  void AddPromise(JS::Heap<JSObject*>& promise, Future<std::function<JS::HandleValue(const ScriptRequest&)>>&& future);
                                                                                                          ^~
../../../source/scriptinterface/ScriptInterface.h:218:60: error: 'function' is not a member of 'std'
  void AddPromise(JS::Heap<JSObject*>& promise, Future<std::function<JS::HandleValue(const ScriptRequest&)>>&& future);
                                                            ^~~~~~~~
../../../source/scriptinterface/ScriptInterface.h:218:60: note: 'std::function' is defined in header '<functional>'; did you forget to '#include <functional>'?
../../../source/scriptinterface/ScriptInterface.h:218:106: error: template argument 1 is invalid
  void AddPromise(JS::Heap<JSObject*>& promise, Future<std::function<JS::HandleValue(const ScriptRequest&)>>&& future);
                                                                                                          ^~
../../../source/scriptinterface/ScriptInterface.h:218:60: error: 'function' is not a member of 'std'
  void AddPromise(JS::Heap<JSObject*>& promise, Future<std::function<JS::HandleValue(const ScriptRequest&)>>&& future);
                                                            ^~~~~~~~
../../../source/scriptinterface/ScriptInterface.h:218:60: note: 'std::function' is defined in header '<functional>'; did you forget to '#include <functional>'?
../../../source/scriptinterface/ScriptInterface.h:218:106: error: template argument 1 is invalid
  void AddPromise(JS::Heap<JSObject*>& promise, Future<std::function<JS::HandleValue(const ScriptRequest&)>>&& future);
                                                                                                          ^~
../../../source/scriptinterface/ScriptInterface.h:218:48: error: invalid template-id
  void AddPromise(JS::Heap<JSObject*>& promise, Future<std::function<JS::HandleValue(const ScriptRequest&)>>&& future);
                                                ^~~~~~
../../../source/scriptinterface/ScriptInterface.h:218:60: error: 'function' is not a member of 'std'
  void AddPromise(JS::Heap<JSObject*>& promise, Future<std::function<JS::HandleValue(const ScriptRequest&)>>&& future);
                                                            ^~~~~~~~
../../../source/scriptinterface/ScriptInterface.h:218:60: note: 'std::function' is defined in header '<functional>'; did you forget to '#include <functional>'?
../../../source/scriptinterface/ScriptInterface.h:218:84: error: expected primary-expression before '(' token
  void AddPromise(JS::Heap<JSObject*>& promise, Future<std::function<JS::HandleValue(const ScriptRequest&)>>&& future);
                                                                                    ^
../../../source/scriptinterface/ScriptInterface.h:218:85: error: expected primary-expression before 'const'
  void AddPromise(JS::Heap<JSObject*>& promise, Future<std::function<JS::HandleValue(const ScriptRequest&)>>&& future);
                                                                                     ^~~~~
../../../source/scriptinterface/ScriptInterface.h:218:48: error: template placeholder type 'Future' must be followed by a simple declarator-id
  void AddPromise(JS::Heap<JSObject*>& promise, Future<std::function<JS::HandleValue(const ScriptRequest&)>>&& future);
                                                ^~~~~~
In file included from ../../../source/scriptinterface/ScriptInterface.h:27,
                 from ../../../source/simulation2/system/InterfaceScripted.h:23,
                 from ../../../source/simulation2/components/ICmpAIInterface.cpp:22:
../../../source/ps/FutureForward.h:27:7: note: 'template<class Ret> class Future' declared here
 class Future;
       ^~~~~~
In file included from ../../../source/simulation2/system/InterfaceScripted.h:23,
                 from ../../../source/simulation2/components/ICmpAIInterface.cpp:22:
../../../source/scriptinterface/ScriptInterface.h:218:111: error: 'auto' parameter not permitted in this context
  void AddPromise(JS::Heap<JSObject*>& promise, Future<std::function<JS::HandleValue(const ScriptRequest&)>>&& future);
                                                                                                               ^~~~~~
make[1]: *** [simulation2.make:339: obj/simulation2_Debug/ICmpAIInterface.o] Error 1
make: *** [Makefile:109: simulation2] Error 2

Link to build: https://jenkins.wildfiregames.com/job/docker-differential/7739/display/redirect

wraitii added inline comments.May 15 2022, 11:40 AM
source/scriptinterface/Promises.h
84

I almost certainly want to clean those const_cast, but they require some potentially far-reaching code changes.

Successful build - Chance fights ever on the side of the prudent.

Debug:
    12>e:\jenkins\workspace\vs2015-differential\libraries\source\spidermonkey\include-win32-debug\js\promise.h(255): warning C4251: 'JS::AutoDebuggerJobQueueInterruption::_mCheckNotUsedAsTemporary': class 'mozilla::detail::GuardObjectNotificationReceiver' needs to have dll-interface to be used by clients of class 'JS::AutoDebuggerJobQueueInterruption' (compiling source file ..\..\..\source\scriptinterface\ScriptContext.cpp) [E:\Jenkins\workspace\vs2015-differential\build\workspaces\vs2017\scriptinterface.vcxproj]
    12>e:\jenkins\workspace\vs2015-differential\libraries\source\spidermonkey\include-win32-debug\js\promise.h(257): warning C4251: 'JS::AutoDebuggerJobQueueInterruption::saved': class 'mozilla::UniquePtr<JS::JobQueue::SavedJobQueue,JS::DeletePolicy<T>>' needs to have dll-interface to be used by clients of class 'JS::AutoDebuggerJobQueueInterruption' [E:\Jenkins\workspace\vs2015-differential\build\workspaces\vs2017\scriptinterface.vcxproj]
    12>e:\jenkins\workspace\vs2015-differential\libraries\source\spidermonkey\include-win32-debug\js\promise.h(255): warning C4251: 'JS::AutoDebuggerJobQueueInterruption::_mCheckNotUsedAsTemporary': class 'mozilla::detail::GuardObjectNotificationReceiver' needs to have dll-interface to be used by clients of class 'JS::AutoDebuggerJobQueueInterruption' (compiling source file ..\..\..\source\scriptinterface\ScriptInterface.cpp) [E:\Jenkins\workspace\vs2015-differential\build\workspaces\vs2017\scriptinterface.vcxproj]
    12>e:\jenkins\workspace\vs2015-differential\libraries\source\spidermonkey\include-win32-debug\js\promise.h(257): warning C4251: 'JS::AutoDebuggerJobQueueInterruption::saved': class 'mozilla::UniquePtr<JS::JobQueue::SavedJobQueue,JS::DeletePolicy<T>>' needs to have dll-interface to be used by clients of class 'JS::AutoDebuggerJobQueueInterruption' [E:\Jenkins\workspace\vs2015-differential\build\workspaces\vs2017\scriptinterface.vcxproj]
    23>e:\jenkins\workspace\vs2015-differential\libraries\source\spidermonkey\include-win32-debug\js\promise.h(255): warning C4251: 'JS::AutoDebuggerJobQueueInterruption::_mCheckNotUsedAsTemporary': class 'mozilla::detail::GuardObjectNotificationReceiver' needs to have dll-interface to be used by clients of class 'JS::AutoDebuggerJobQueueInterruption' (compiling source file ..\..\..\source\scriptinterface\tests\test_Promises.cpp) [E:\Jenkins\workspace\vs2015-differential\build\workspaces\vs2017\test.vcxproj]
    23>e:\jenkins\workspace\vs2015-differential\libraries\source\spidermonkey\include-win32-debug\js\promise.h(257): warning C4251: 'JS::AutoDebuggerJobQueueInterruption::saved': class 'mozilla::UniquePtr<JS::JobQueue::SavedJobQueue,JS::DeletePolicy<T>>' needs to have dll-interface to be used by clients of class 'JS::AutoDebuggerJobQueueInterruption' [E:\Jenkins\workspace\vs2015-differential\build\workspaces\vs2017\test.vcxproj]
Release:
    12>e:\jenkins\workspace\vs2015-differential\libraries\source\spidermonkey\include-win32-release\js\promise.h(257): warning C4251: 'JS::AutoDebuggerJobQueueInterruption::saved': class 'mozilla::UniquePtr<JS::JobQueue::SavedJobQueue,JS::DeletePolicy<T>>' needs to have dll-interface to be used by clients of class 'JS::AutoDebuggerJobQueueInterruption' [E:\Jenkins\workspace\vs2015-differential\build\workspaces\vs2017\scriptinterface.vcxproj]
    12>e:\jenkins\workspace\vs2015-differential\libraries\source\spidermonkey\include-win32-release\js\promise.h(257): warning C4251: 'JS::AutoDebuggerJobQueueInterruption::saved': class 'mozilla::UniquePtr<JS::JobQueue::SavedJobQueue,JS::DeletePolicy<T>>' needs to have dll-interface to be used by clients of class 'JS::AutoDebuggerJobQueueInterruption' [E:\Jenkins\workspace\vs2015-differential\build\workspaces\vs2017\scriptinterface.vcxproj]
    23>e:\jenkins\workspace\vs2015-differential\libraries\source\spidermonkey\include-win32-release\js\promise.h(257): warning C4251: 'JS::AutoDebuggerJobQueueInterruption::saved': class 'mozilla::UniquePtr<JS::JobQueue::SavedJobQueue,JS::DeletePolicy<T>>' needs to have dll-interface to be used by clients of class 'JS::AutoDebuggerJobQueueInterruption' [E:\Jenkins\workspace\vs2015-differential\build\workspaces\vs2017\test.vcxproj]

Link to build: https://jenkins.wildfiregames.com/job/vs2015-differential/7133/display/redirect

Successful build - Chance fights ever on the side of the prudent.

builderr-debug-macos.txt
/Applications/Xcode.app/Contents/Developer/Toolchains/XcodeDefault.xctoolchain/usr/bin/ranlib: file: ../../../binaries/system/libnetwork_dbg.a(precompiled.o) has no symbols
/Applications/Xcode.app/Contents/Developer/Toolchains/XcodeDefault.xctoolchain/usr/bin/ranlib: file: ../../../binaries/system/liblobby_dbg.a(precompiled.o) has no symbols
/Applications/Xcode.app/Contents/Developer/Toolchains/XcodeDefault.xctoolchain/usr/bin/ranlib: file: ../../../binaries/system/libsimulation2_dbg.a(precompiled.o) has no symbols
/Applications/Xcode.app/Contents/Developer/Toolchains/XcodeDefault.xctoolchain/usr/bin/ranlib: file: ../../../binaries/system/libscriptinterface_dbg.a(precompiled.o) has no symbols
/Applications/Xcode.app/Contents/Developer/Toolchains/XcodeDefault.xctoolchain/usr/bin/ranlib: file: ../../../binaries/system/libengine_dbg.a(precompiled.o) has no symbols
/Applications/Xcode.app/Contents/Developer/Toolchains/XcodeDefault.xctoolchain/usr/bin/ranlib: file: ../../../binaries/system/libgraphics_dbg.a(precompiled.o) has no symbols
/Applications/Xcode.app/Contents/Developer/Toolchains/XcodeDefault.xctoolchain/usr/bin/ranlib: file: ../../../binaries/system/libatlas_dbg.a(precompiled.o) has no symbols
/Applications/Xcode.app/Contents/Developer/Toolchains/XcodeDefault.xctoolchain/usr/bin/ranlib: file: ../../../binaries/system/libgui_dbg.a(precompiled.o) has no symbols
ld: warning: text-based stub file /System/Library/Frameworks//CoreAudio.framework/CoreAudio.tbd and library file /System/Library/Frameworks//CoreAudio.framework/CoreAudio are out of sync. Falling back to library file for linking.
ld: warning: text-based stub file /System/Library/Frameworks//AudioToolbox.framework/AudioToolbox.tbd and library file /System/Library/Frameworks//AudioToolbox.framework/AudioToolbox are out of sync. Falling back to library file for linking.
ld: warning: text-based stub file /System/Library/Frameworks//ForceFeedback.framework/ForceFeedback.tbd and library file /System/Library/Frameworks//ForceFeedback.framework/ForceFeedback are out of sync. Falling back to library file for linking.
ld: warning: text-based stub file /System/Library/Frameworks//CoreVideo.framework/CoreVideo.tbd and library file /System/Library/Frameworks//CoreVideo.framework/CoreVideo are out of sync. Falling back to library file for linking.
ld: warning: text-based stub file /System/Library/Frameworks//Cocoa.framework/Cocoa.tbd and library file /System/Library/Frameworks//Cocoa.framework/Cocoa are out of sync. Falling back to library file for linking.
ld: warning: text-based stub file /System/Library/Frameworks//IOKit.framework/IOKit.tbd and library file /System/Library/Frameworks//IOKit.framework/IOKit are out of sync. Falling back to library file for linking.
ld: warning: text-based stub file /System/Library/Frameworks//QuartzCore.framework/QuartzCore.tbd and library file /System/Library/Frameworks//QuartzCore.framework/QuartzCore are out of sync. Falling back to library file for linking.
ld: warning: text-based stub file /System/Library/Frameworks//Metal.framework/Metal.tbd and library file /System/Library/Frameworks//Metal.framework/Metal are out of sync. Falling back to library file for linking.
ld: warning: text-based stub file /System/Library/Frameworks//Security.framework/Security.tbd and library file /System/Library/Frameworks//Security.framework/Security are out of sync. Falling back to library file for linking.
ld: warning: text-based stub file /System/Library/Frameworks//OpenAL.framework/OpenAL.tbd and library file /System/Library/Frameworks//OpenAL.framework/OpenAL are out of sync. Falling back to library file for linking.
ld: warning: text-based stub file /System/Library/Frameworks//ApplicationServices.framework/ApplicationServices.tbd and library file /System/Library/Frameworks//ApplicationServices.framework/ApplicationServices are out of sync. Falling back to library file for linking.
ld: warning: text-based stub file /System/Library/Frameworks//Cocoa.framework/Cocoa.tbd and library file /System/Library/Frameworks//Cocoa.framework/Cocoa are out of sync. Falling back to library file for linking.
ld: warning: text-based stub file /System/Library/Frameworks//CoreFoundation.framework/CoreFoundation.tbd and library file /System/Library/Frameworks//CoreFoundation.framework/CoreFoundation are out of sync. Falling back to library file for linking.
ld: warning: text-based stub file /System/Library/Frameworks//AppKit.framework/Versions/C/AppKit.tbd and library file /System/Library/Frameworks//AppKit.framework/Versions/C/AppKit are out of sync. Falling back to library file for linking.
ld: warning: text-based stub file /System/Library/Frameworks//CoreData.framework/Versions/A/CoreData.tbd and library file /System/Library/Frameworks//CoreData.framework/Versions/A/CoreData are out of sync. Falling back to library file for linking.
ld: warning: text-based stub file /System/Library/Frameworks/Carbon.framework/Versions/A/Frameworks/CommonPanels.framework/Versions/A/CommonPanels.tbd and library file /System/Library/Frameworks/Carbon.framework/Versions/A/Frameworks/CommonPanels.framework/Versions/A/CommonPanels are out of sync. Falling back to library file for linking.
ld: warning: text-based stub file /System/Library/Frameworks/Carbon.framework/Versions/A/Frameworks/HIToolbox.framework/Versions/A/HIToolbox.tbd and library file /System/Library/Frameworks/Carbon.framework/Versions/A/Frameworks/HIToolbox.framework/Versions/A/HIToolbox are out of sync. Falling back to library file for linking.
ld: warning: text-based stub file /System/Library/Frameworks/Carbon.framework/Versions/A/Frameworks/Help.framework/Versions/A/Help.tbd and library file /System/Library/Frameworks/Carbon.framework/Versions/A/Frameworks/Help.framework/Versions/A/Help are out of sync. Falling back to library file for linking.
ld: warning: text-based stub file /System/Library/Frameworks/Carbon.framework/Versions/A/Frameworks/ImageCapture.framework/Versions/A/ImageCapture.tbd and library file /System/Library/Frameworks/Carbon.framework/Versions/A/Frameworks/ImageCapture.framework/Versions/A/ImageCapture are out of sync. Falling back to library file for linking.
ld: warning: text-based stub file /System/Library/Frameworks/Carbon.framework/Versions/A/Frameworks/Ink.framework/Versions/A/Ink.tbd and library file /System/Library/Frameworks/Carbon.framework/Versions/A/Frameworks/Ink.framework/Versions/A/Ink are out of sync. Falling back to library file for linking.
ld: warning: text-based stub file /System/Library/Frameworks/Carbon.framework/Versions/A/Frameworks/OpenScripting.framework/Versions/A/OpenScripting.tbd and library file /System/Library/Frameworks/Carbon.framework/Versions/A/Frameworks/OpenScripting.framework/Versions/A/OpenScripting are out of sync. Falling back to library file for linking.
ld: warning: text-based stub file /System/Library/Frameworks/Carbon.framework/Versions/A/Frameworks/Print.framework/Versions/A/Print.tbd and library file /System/Library/Frameworks/Carbon.framework/Versions/A/Frameworks/Print.framework/Versions/A/Print are out of sync. Falling back to library file for linking.
ld: warning: text-based stub file /System/Library/Frameworks/Carbon.framework/Versions/A/Frameworks/SecurityHI.framework/Versions/A/SecurityHI.tbd and library file /System/Library/Frameworks/Carbon.framework/Versions/A/Frameworks/SecurityHI.framework/Versions/A/SecurityHI are out of sync. Falling back to library file for linking.
ld: warning: text-based stub file /System/Library/Frameworks/Carbon.framework/Versions/A/Frameworks/SpeechRecognition.framework/Versions/A/SpeechRecognition.tbd and library file /System/Library/Frameworks/Carbon.framework/Versions/A/Frameworks/SpeechRecognition.framework/Versions/A/SpeechRecognition are out of sync. Falling back to library file for linking.
ld: warning: text-based stub file /System/Library/Frameworks//CoreImage.framework/Versions/A/CoreImage.tbd and library file /System/Library/Frameworks//CoreImage.framework/Versions/A/CoreImage are out of sync. Falling back to library file for linking.
ld: warning: text-based stub file /System/Library/Frameworks//CoreGraphics.framework/Versions/A/CoreGraphics.tbd and library file /System/Library/Frameworks//CoreGraphics.framework/Versions/A/CoreGraphics are out of sync. Falling back to library file for linking.
ld: warning: text-based stub file /System/Library/Frameworks//CoreText.framework/Versions/A/CoreText.tbd and library file /System/Library/Frameworks//CoreText.framework/Versions/A/CoreText are out of sync. Falling back to library file for linking.
ld: warning: text-based stub file /System/Library/Frameworks//ImageIO.framework/Versions/A/ImageIO.tbd and library file /System/Library/Frameworks//ImageIO.framework/Versions/A/ImageIO are out of sync. Falling back to library file for linking.
ld: warning: text-based stub file /System/Library/Frameworks//ColorSync.framework/Versions/A/ColorSync.tbd and library file /System/Library/Frameworks//ColorSync.framework/Versions/A/ColorSync are out of sync. Falling back to library file for linking.
ld: warning: text-based stub file /System/Library/Frameworks/ApplicationServices.framework/Versions/A/Frameworks/ATS.framework/Versions/A/ATS.tbd and library file /System/Library/Frameworks/ApplicationServices.framework/Versions/A/Frameworks/ATS.framework/Versions/A/ATS are out of sync. Falling back to library file for linking.
ld: warning: text-based stub file /System/Library/Frameworks/ApplicationServices.framework/Versions/A/Frameworks/ColorSyncLegacy.framework/Versions/A/ColorSyncLegacy.tbd and library file /System/Library/Frameworks/ApplicationServices.framework/Versions/A/Frameworks/ColorSyncLegacy.framework/Versions/A/ColorSyncLegacy are out of sync. Falling back to library file for linking.
ld: warning: text-based stub file /System/Library/Frameworks//CoreServices.framework/Versions/A/CoreServices.tbd and library file /System/Library/Frameworks//CoreServices.framework/Versions/A/CoreServices are out of sync. Falling back to library file for linking.
ld: warning: text-based stub file /System/Library/Frameworks/ApplicationServices.framework/Versions/A/Frameworks/HIServices.framework/Versions/A/HIServices.tbd and library file /System/Library/Frameworks/ApplicationServices.framework/Versions/A/Frameworks/HIServices.framework/Versions/A/HIServices are out of sync. Falling back to library file for linking.
ld: warning: text-based stub file /System/Library/Frameworks/ApplicationServices.framework/Versions/A/Frameworks/LangAnalysis.framework/Versions/A/LangAnalysis.tbd and library file /System/Library/Frameworks/ApplicationServices.framework/Versions/A/Frameworks/LangAnalysis.framework/Versions/A/LangAnalysis are out of sync. Falling back to library file for linking.
ld: warning: text-based stub file /System/Library/Frameworks/ApplicationServices.framework/Versions/A/Frameworks/PrintCore.framework/Versions/A/PrintCore.tbd and library file /System/Library/Frameworks/ApplicationServices.framework/Versions/A/Frameworks/PrintCore.framework/Versions/A/PrintCore are out of sync. Falling back to library file for linking.
ld: warning: text-based stub file /System/Library/Frameworks/ApplicationServices.framework/Versions/A/Frameworks/QD.framework/Versions/A/QD.tbd and library file /System/Library/Frameworks/ApplicationServices.framework/Versions/A/Frameworks/QD.framework/Versions/A/QD are out of sync. Falling back to library file for linking.
ld: warning: text-based stub file /System/Library/Frameworks/ApplicationServices.framework/Versions/A/Frameworks/SpeechSynthesis.framework/Versions/A/SpeechSynthesis.tbd and library file /System/Library/Frameworks/ApplicationServices.framework/Versions/A/Frameworks/SpeechSynthesis.framework/Versions/A/SpeechSynthesis are out of sync. Falling back to library file for linking.
ld: warning: text-based stub file /System/Library/PrivateFrameworks/UIFoundation.framework/Versions/A/UIFoundation.tbd and library file /System/Library/PrivateFrameworks/UIFoundation.framework/Versions/A/UIFoundation are out of sync. Falling back to library file for linking.
ld: warning: text-based stub file /System/Library/Frameworks//Foundation.framework/Versions/C/Foundation.tbd and library file /System/Library/Frameworks//Foundation.framework/Versions/C/Foundation are out of sync. Falling back to library file for linking.
ld: warning: text-based stub file /System/Library/Frameworks//CFNetwork.framework/Versions/A/CFNetwork.tbd and library file /System/Library/Frameworks//CFNetwork.framework/Versions/A/CFNetwork are out of sync. Falling back to library file for linking.
ld: warning: text-based stub file /System/Library/Frameworks/CoreServices.framework/Versions/A/Frameworks/FSEvents.framework/Versions/A/FSEvents.tbd and library file /System/Library/Frameworks/CoreServices.framework/Versions/A/Frameworks/FSEvents.framework/Versions/A/FSEvents are out of sync. Falling back to library file for linking.
ld: warning: text-based stub file /System/Library/Frameworks/CoreServices.framework/Versions/A/Frameworks/CarbonCore.framework/Versions/A/CarbonCore.tbd and library file /System/Library/Frameworks/CoreServices.framework/Versions/A/Frameworks/CarbonCore.framework/Versions/A/CarbonCore are out of sync. Falling back to library file for linking.
ld: warning: text-based stub file /System/Library/Frameworks/CoreServices.framework/Versions/A/Frameworks/Metadata.framework/Versions/A/Metadata.tbd and library file /System/Library/Frameworks/CoreServices.framework/Versions/A/Frameworks/Metadata.framework/Versions/A/Metadata are out of sync. Falling back to library file for linking.
ld: warning: text-based stub file /System/Library/Frameworks/CoreServices.framework/Versions/A/Frameworks/OSServices.framework/Versions/A/OSServices.tbd and library file /System/Library/Frameworks/CoreServices.framework/Versions/A/Frameworks/OSServices.framework/Versions/A/OSServices are out of sync. Falling back to library file for linking.
ld: warning: text-based stub file /System/Library/Frameworks/CoreServices.framework/Versions/A/Frameworks/SearchKit.framework/Versions/A/SearchKit.tbd and library file /System/Library/Frameworks/CoreServices.framework/Versions/A/Frameworks/SearchKit.framework/Versions/A/SearchKit are out of sync. Falling back to library file for linking.
ld: warning: text-based stub file /System/Library/Frameworks/CoreServices.framework/Versions/A/Frameworks/AE.framework/Versions/A/AE.tbd and library file /System/Library/Frameworks/CoreServices.framework/Versions/A/Frameworks/AE.framework/Versions/A/AE are out of sync. Falling back to library file for linking.
ld: warning: text-based stub file /System/Library/Frameworks/CoreServices.framework/Versions/A/Frameworks/LaunchServices.framework/Versions/A/LaunchServices.tbd and library file /System/Library/Frameworks/CoreServices.framework/Versions/A/Frameworks/LaunchServices.framework/Versions/A/LaunchServices are out of sync. Falling back to library file for linking.
ld: warning: text-based stub file /System/Library/Frameworks/CoreServices.framework/Versions/A/Frameworks/DictionaryServices.framework/Versions/A/DictionaryServices.tbd and library file /System/Library/Frameworks/CoreServices.framework/Versions/A/Frameworks/DictionaryServices.framework/Versions/A/DictionaryServices are out of sync. Falling back to library file for linking.
ld: warning: text-based stub file /System/Library/Frameworks/CoreServices.framework/Versions/A/Frameworks/SharedFileList.framework/Versions/A/SharedFileList.tbd and library file /System/Library/Frameworks/CoreServices.framework/Versions/A/Frameworks/SharedFileList.framework/Versions/A/SharedFileList are out of sync. Falling back to library file for linking.
ld: warning: object file (../../../libraries/osx/fmt/lib/libfmt.a(format.cc.o)) was built for newer OSX version (10.13) than being linked (10.12)
ld: warning: text-based stub file /System/Library/Frameworks//CoreFoundation.framework/CoreFoundation.tbd and library file /System/Library/Frameworks//CoreFoundation.framework/CoreFoundation are out of sync. Falling back to library file for linking.
ld: warning: text-based stub file /System/Library/Frameworks//CoreAudio.framework/CoreAudio.tbd and library file /System/Library/Frameworks//CoreAudio.framework/CoreAudio are out of sync. Falling back to library file for linking.
ld: warning: text-based stub file /System/Library/Frameworks//AudioToolbox.framework/AudioToolbox.tbd and library file /System/Library/Frameworks//AudioToolbox.framework/AudioToolbox are out of sync. Falling back to library file for linking.
ld: warning: text-based stub file /System/Library/Frameworks//ForceFeedback.framework/ForceFeedback.tbd and library file /System/Library/Frameworks//ForceFeedback.framework/ForceFeedback are out of sync. Falling back to library file for linking.
ld: warning: text-based stub file /System/Library/Frameworks//CoreVideo.framework/CoreVideo.tbd and library file /System/Library/Frameworks//CoreVideo.framework/CoreVideo are out of sync. Falling back to library file for linking.
ld: warning: text-based stub file /System/Library/Frameworks//Cocoa.framework/Cocoa.tbd and library file /System/Library/Frameworks//Cocoa.framework/Cocoa are out of sync. Falling back to library file for linking.
ld: warning: text-based stub file /System/Library/Frameworks//IOKit.framework/IOKit.tbd and library file /System/Library/Frameworks//IOKit.framework/IOKit are out of sync. Falling back to library file for linking.
ld: warning: text-based stub file /System/Library/Frameworks//QuartzCore.framework/QuartzCore.tbd and library file /System/Library/Frameworks//QuartzCore.framework/QuartzCore are out of sync. Falling back to library file for linking.
ld: warning: text-based stub file /System/Library/Frameworks//Metal.framework/Metal.tbd and library file /System/Library/Frameworks//Metal.framework/Metal are out of sync. Falling back to library file for linking.
ld: warning: text-based stub file /System/Library/Frameworks//Security.framework/Security.tbd and library file /System/Library/Frameworks//Security.framework/Security are out of sync. Falling back to library file for linking.
ld: warning: text-based stub file /System/Library/Frameworks//OpenAL.framework/OpenAL.tbd and library file /System/Library/Frameworks//OpenAL.framework/OpenAL are out of sync. Falling back to library file for linking.
ld: warning: text-based stub file /System/Library/Frameworks//AppKit.framework/Versions/C/AppKit.tbd and library file /System/Library/Frameworks//AppKit.framework/Versions/C/AppKit are out of sync. Falling back to library file for linking.
ld: warning: text-based stub file /System/Library/Frameworks//CoreData.framework/Versions/A/CoreData.tbd and library file /System/Library/Frameworks//CoreData.framework/Versions/A/CoreData are out of sync. Falling back to library file for linking.
ld: warning: text-based stub file /System/Library/Frameworks//ApplicationServices.framework/Versions/A/ApplicationServices.tbd and library file /System/Library/Frameworks//ApplicationServices.framework/Versions/A/ApplicationServices are out of sync. Falling back to library file for linking.
ld: warning: text-based stub file /System/Library/Frameworks/Carbon.framework/Versions/A/Frameworks/CommonPanels.framework/Versions/A/CommonPanels.tbd and library file /System/Library/Frameworks/Carbon.framework/Versions/A/Frameworks/CommonPanels.framework/Versions/A/CommonPanels are out of sync. Falling back to library file for linking.
ld: warning: text-based stub file /System/Library/Frameworks/Carbon.framework/Versions/A/Frameworks/HIToolbox.framework/Versions/A/HIToolbox.tbd and library file /System/Library/Frameworks/Carbon.framework/Versions/A/Frameworks/HIToolbox.framework/Versions/A/HIToolbox are out of sync. Falling back to library file for linking.
ld: warning: text-based stub file /System/Library/Frameworks/Carbon.framework/Versions/A/Frameworks/Help.framework/Versions/A/Help.tbd and library file /System/Library/Frameworks/Carbon.framework/Versions/A/Frameworks/Help.framework/Versions/A/Help are out of sync. Falling back to library file for linking.
ld: warning: text-based stub file /System/Library/Frameworks/Carbon.framework/Versions/A/Frameworks/ImageCapture.framework/Versions/A/ImageCapture.tbd and library file /System/Library/Frameworks/Carbon.framework/Versions/A/Frameworks/ImageCapture.framework/Versions/A/ImageCapture are out of sync. Falling back to library file for linking.
ld: warning: text-based stub file /System/Library/Frameworks/Carbon.framework/Versions/A/Frameworks/Ink.framework/Versions/A/Ink.tbd and library file /System/Library/Frameworks/Carbon.framework/Versions/A/Frameworks/Ink.framework/Versions/A/Ink are out of sync. Falling back to library file for linking.
ld: warning: text-based stub file /System/Library/Frameworks/Carbon.framework/Versions/A/Frameworks/OpenScripting.framework/Versions/A/OpenScripting.tbd and library file /System/Library/Frameworks/Carbon.framework/Versions/A/Frameworks/OpenScripting.framework/Versions/A/OpenScripting are out of sync. Falling back to library file for linking.
ld: warning: text-based stub file /System/Library/Frameworks/Carbon.framework/Versions/A/Frameworks/Print.framework/Versions/A/Print.tbd and library file /System/Library/Frameworks/Carbon.framework/Versions/A/Frameworks/Print.framework/Versions/A/Print are out of sync. Falling back to library file for linking.
ld: warning: text-based stub file /System/Library/Frameworks/Carbon.framework/Versions/A/Frameworks/SecurityHI.framework/Versions/A/SecurityHI.tbd and library file /System/Library/Frameworks/Carbon.framework/Versions/A/Frameworks/SecurityHI.framework/Versions/A/SecurityHI are out of sync. Falling back to library file for linking.
ld: warning: text-based stub file /System/Library/Frameworks/Carbon.framework/Versions/A/Frameworks/SpeechRecognition.framework/Versions/A/SpeechRecognition.tbd and library file /System/Library/Frameworks/Carbon.framework/Versions/A/Frameworks/SpeechRecognition.framework/Versions/A/SpeechRecognition are out of sync. Falling back to library file for linking.
ld: warning: text-based stub file /System/Library/Frameworks//CoreImage.framework/Versions/A/CoreImage.tbd and library file /System/Library/Frameworks//CoreImage.framework/Versions/A/CoreImage are out of sync. Falling back to library file for linking.
ld: warning: text-based stub file /System/Library/PrivateFrameworks/UIFoundation.framework/Versions/A/UIFoundation.tbd and library file /System/Library/PrivateFrameworks/UIFoundation.framework/Versions/A/UIFoundation are out of sync. Falling back to library file for linking.
ld: warning: text-based stub file /System/Library/Frameworks//Foundation.framework/Versions/C/Foundation.tbd and library file /System/Library/Frameworks//Foundation.framework/Versions/C/Foundation are out of sync. Falling back to library file for linking.
ld: warning: text-based stub file /System/Library/Frameworks//CoreGraphics.framework/Versions/A/CoreGraphics.tbd and library file /System/Library/Frameworks//CoreGraphics.framework/Versions/A/CoreGraphics are out of sync. Falling back to library file for linking.
ld: warning: text-based stub file /System/Library/Frameworks//CoreText.framework/Versions/A/CoreText.tbd and library file /System/Library/Frameworks//CoreText.framework/Versions/A/CoreText are out of sync. Falling back to library file for linking.
ld: warning: text-based stub file /System/Library/Frameworks//ImageIO.framework/Versions/A/ImageIO.tbd and library file /System/Library/Frameworks//ImageIO.framework/Versions/A/ImageIO are out of sync. Falling back to library file for linking.
ld: warning: text-based stub file /System/Library/Frameworks//ColorSync.framework/Versions/A/ColorSync.tbd and library file /System/Library/Frameworks//ColorSync.framework/Versions/A/ColorSync are out of sync. Falling back to library file for linking.
ld: warning: text-based stub file /System/Library/Frameworks/ApplicationServices.framework/Versions/A/Frameworks/ATS.framework/Versions/A/ATS.tbd and library file /System/Library/Frameworks/ApplicationServices.framework/Versions/A/Frameworks/ATS.framework/Versions/A/ATS are out of sync. Falling back to library file for linking.
ld: warning: text-based stub file /System/Library/Frameworks/ApplicationServices.framework/Versions/A/Frameworks/ColorSyncLegacy.framework/Versions/A/ColorSyncLegacy.tbd and library file /System/Library/Frameworks/ApplicationServices.framework/Versions/A/Frameworks/ColorSyncLegacy.framework/Versions/A/ColorSyncLegacy are out of sync. Falling back to library file for linking.
ld: warning: text-based stub file /System/Library/Frameworks//CoreServices.framework/Versions/A/CoreServices.tbd and library file /System/Library/Frameworks//CoreServices.framework/Versions/A/CoreServices are out of sync. Falling back to library file for linking.
ld: warning: text-based stub file /System/Library/Frameworks/ApplicationServices.framework/Versions/A/Frameworks/HIServices.framework/Versions/A/HIServices.tbd and library file /System/Library/Frameworks/ApplicationServices.framework/Versions/A/Frameworks/HIServices.framework/Versions/A/HIServices are out of sync. Falling back to library file for linking.
ld: warning: text-based stub file /System/Library/Frameworks/ApplicationServices.framework/Versions/A/Frameworks/LangAnalysis.framework/Versions/A/LangAnalysis.tbd and library file /System/Library/Frameworks/ApplicationServices.framework/Versions/A/Frameworks/LangAnalysis.framework/Versions/A/LangAnalysis are out of sync. Falling back to library file for linking.
ld: warning: text-based stub file /System/Library/Frameworks/ApplicationServices.framework/Versions/A/Frameworks/PrintCore.framework/Versions/A/PrintCore.tbd and library file /System/Library/Frameworks/ApplicationServices.framework/Versions/A/Frameworks/PrintCore.framework/Versions/A/PrintCore are out of sync. Falling back to library file for linking.
ld: warning: text-based stub file /System/Library/Frameworks/ApplicationServices.framework/Versions/A/Frameworks/QD.framework/Versions/A/QD.tbd and library file /System/Library/Frameworks/ApplicationServices.framework/Versions/A/Frameworks/QD.framework/Versions/A/QD are out of sync. Falling back to library file for linking.
ld: warning: text-based stub file /System/Library/Frameworks/ApplicationServices.framework/Versions/A/Frameworks/SpeechSynthesis.framework/Versions/A/SpeechSynthesis.tbd and library file /System/Library/Frameworks/ApplicationServices.framework/Versions/A/Frameworks/SpeechSynthesis.framework/Versions/A/SpeechSynthesis are out of sync. Falling back to library file for linking.
ld: warning: text-based stub file /System/Library/Frameworks//CoreFoundation.framework/Versions/A/CoreFoundation.tbd and library file /System/Library/Frameworks//CoreFoundation.framework/Versions/A/CoreFoundation are out of sync. Falling back to library file for linking.
ld: warning: text-based stub file /System/Library/Frameworks//CFNetwork.framework/Versions/A/CFNetwork.tbd and library file /System/Library/Frameworks//CFNetwork.framework/Versions/A/CFNetwork are out of sync. Falling back to library file for linking.
ld: warning: text-based stub file /System/Library/Frameworks/CoreServices.framework/Versions/A/Frameworks/FSEvents.framework/Versions/A/FSEvents.tbd and library file /System/Library/Frameworks/CoreServices.framework/Versions/A/Frameworks/FSEvents.framework/Versions/A/FSEvents are out of sync. Falling back to library file for linking.
ld: warning: text-based stub file /System/Library/Frameworks/CoreServices.framework/Versions/A/Frameworks/CarbonCore.framework/Versions/A/CarbonCore.tbd and library file /System/Library/Frameworks/CoreServices.framework/Versions/A/Frameworks/CarbonCore.framework/Versions/A/CarbonCore are out of sync. Falling back to library file for linking.
ld: warning: text-based stub file /System/Library/Frameworks/CoreServices.framework/Versions/A/Frameworks/Metadata.framework/Versions/A/Metadata.tbd and library file /System/Library/Frameworks/CoreServices.framework/Versions/A/Frameworks/Metadata.framework/Versions/A/Metadata are out of sync. Falling back to library file for linking.
ld: warning: text-based stub file /System/Library/Frameworks/CoreServices.framework/Versions/A/Frameworks/OSServices.framework/Versions/A/OSServices.tbd and library file /System/Library/Frameworks/CoreServices.framework/Versions/A/Frameworks/OSServices.framework/Versions/A/OSServices are out of sync. Falling back to library file for linking.
ld: warning: text-based stub file /System/Library/Frameworks/CoreServices.framework/Versions/A/Frameworks/SearchKit.framework/Versions/A/SearchKit.tbd and library file /System/Library/Frameworks/CoreServices.framework/Versions/A/Frameworks/SearchKit.framework/Versions/A/SearchKit are out of sync. Falling back to library file for linking.
ld: warning: text-based stub file /System/Library/Frameworks/CoreServices.framework/Versions/A/Frameworks/AE.framework/Versions/A/AE.tbd and library file /System/Library/Frameworks/CoreServices.framework/Versions/A/Frameworks/AE.framework/Versions/A/AE are out of sync. Falling back to library file for linking.
ld: warning: text-based stub file /System/Library/Frameworks/CoreServices.framework/Versions/A/Frameworks/LaunchServices.framework/Versions/A/LaunchServices.tbd and library file /System/Library/Frameworks/CoreServices.framework/Versions/A/Frameworks/LaunchServices.framework/Versions/A/LaunchServices are out of sync. Falling back to library file for linking.
ld: warning: text-based stub file /System/Library/Frameworks/CoreServices.framework/Versions/A/Frameworks/DictionaryServices.framework/Versions/A/DictionaryServices.tbd and library file /System/Library/Frameworks/CoreServices.framework/Versions/A/Frameworks/DictionaryServices.framework/Versions/A/DictionaryServices are out of sync. Falling back to library file for linking.
ld: warning: text-based stub file /System/Library/Frameworks/CoreServices.framework/Versions/A/Frameworks/SharedFileList.framework/Versions/A/SharedFileList.tbd and library file /System/Library/Frameworks/CoreServices.framework/Versions/A/Frameworks/SharedFileList.framework/Versions/A/SharedFileList are out of sync. Falling back to library file for linking.
ld: warning: object file (../../../libraries/osx/fmt/lib/libfmt.a(format.cc.o)) was built for newer OSX version (10.13) than being linked (10.12)
ld: warning: text-based stub file /System/Library/Frameworks//CoreFoundation.framework/CoreFoundation.tbd and library file /System/Library/Frameworks//CoreFoundation.framework/CoreFoundation are out of sync. Falling back to library file for linking.
builderr-release-macos.txt
/Applications/Xcode.app/Contents/Developer/Toolchains/XcodeDefault.xctoolchain/usr/bin/ranlib: file: ../../../binaries/system/libnetwork.a(precompiled.o) has no symbols
/Applications/Xcode.app/Contents/Developer/Toolchains/XcodeDefault.xctoolchain/usr/bin/ranlib: file: ../../../binaries/system/liblobby.a(precompiled.o) has no symbols
/Applications/Xcode.app/Contents/Developer/Toolchains/XcodeDefault.xctoolchain/usr/bin/ranlib: file: ../../../binaries/system/libsimulation2.a(precompiled.o) has no symbols
/Applications/Xcode.app/Contents/Developer/Toolchains/XcodeDefault.xctoolchain/usr/bin/ranlib: file: ../../../binaries/system/libscriptinterface.a(precompiled.o) has no symbols
/Applications/Xcode.app/Contents/Developer/Toolchains/XcodeDefault.xctoolchain/usr/bin/ranlib: file: ../../../binaries/system/libengine.a(precompiled.o) has no symbols
/Applications/Xcode.app/Contents/Developer/Toolchains/XcodeDefault.xctoolchain/usr/bin/ranlib: file: ../../../binaries/system/libgraphics.a(precompiled.o) has no symbols
/Applications/Xcode.app/Contents/Developer/Toolchains/XcodeDefault.xctoolchain/usr/bin/ranlib: file: ../../../binaries/system/libatlas.a(precompiled.o) has no symbols
/Applications/Xcode.app/Contents/Developer/Toolchains/XcodeDefault.xctoolchain/usr/bin/ranlib: file: ../../../binaries/system/libgui.a(precompiled.o) has no symbols
ld: warning: text-based stub file /System/Library/Frameworks//CoreAudio.framework/CoreAudio.tbd and library file /System/Library/Frameworks//CoreAudio.framework/CoreAudio are out of sync. Falling back to library file for linking.
ld: warning: text-based stub file /System/Library/Frameworks//AudioToolbox.framework/AudioToolbox.tbd and library file /System/Library/Frameworks//AudioToolbox.framework/AudioToolbox are out of sync. Falling back to library file for linking.
ld: warning: text-based stub file /System/Library/Frameworks//ForceFeedback.framework/ForceFeedback.tbd and library file /System/Library/Frameworks//ForceFeedback.framework/ForceFeedback are out of sync. Falling back to library file for linking.
ld: warning: text-based stub file /System/Library/Frameworks//CoreVideo.framework/CoreVideo.tbd and library file /System/Library/Frameworks//CoreVideo.framework/CoreVideo are out of sync. Falling back to library file for linking.
ld: warning: text-based stub file /System/Library/Frameworks//Cocoa.framework/Cocoa.tbd and library file /System/Library/Frameworks//Cocoa.framework/Cocoa are out of sync. Falling back to library file for linking.
ld: warning: text-based stub file /System/Library/Frameworks//IOKit.framework/IOKit.tbd and library file /System/Library/Frameworks//IOKit.framework/IOKit are out of sync. Falling back to library file for linking.
ld: warning: text-based stub file /System/Library/Frameworks//QuartzCore.framework/QuartzCore.tbd and library file /System/Library/Frameworks//QuartzCore.framework/QuartzCore are out of sync. Falling back to library file for linking.
ld: warning: text-based stub file /System/Library/Frameworks//Metal.framework/Metal.tbd and library file /System/Library/Frameworks//Metal.framework/Metal are out of sync. Falling back to library file for linking.
ld: warning: text-based stub file /System/Library/Frameworks//Security.framework/Security.tbd and library file /System/Library/Frameworks//Security.framework/Security are out of sync. Falling back to library file for linking.
ld: warning: text-based stub file /System/Library/Frameworks//OpenAL.framework/OpenAL.tbd and library file /System/Library/Frameworks//OpenAL.framework/OpenAL are out of sync. Falling back to library file for linking.
ld: warning: text-based stub file /System/Library/Frameworks//ApplicationServices.framework/ApplicationServices.tbd and library file /System/Library/Frameworks//ApplicationServices.framework/ApplicationServices are out of sync. Falling back to library file for linking.
ld: warning: text-based stub file /System/Library/Frameworks//Cocoa.framework/Cocoa.tbd and library file /System/Library/Frameworks//Cocoa.framework/Cocoa are out of sync. Falling back to library file for linking.
ld: warning: text-based stub file /System/Library/Frameworks//CoreFoundation.framework/CoreFoundation.tbd and library file /System/Library/Frameworks//CoreFoundation.framework/CoreFoundation are out of sync. Falling back to library file for linking.
ld: warning: text-based stub file /System/Library/Frameworks//CoreGraphics.framework/Versions/A/CoreGraphics.tbd and library file /System/Library/Frameworks//CoreGraphics.framework/Versions/A/CoreGraphics are out of sync. Falling back to library file for linking.
ld: warning: text-based stub file /System/Library/Frameworks//CoreText.framework/Versions/A/CoreText.tbd and library file /System/Library/Frameworks//CoreText.framework/Versions/A/CoreText are out of sync. Falling back to library file for linking.
ld: warning: text-based stub file /System/Library/Frameworks//ImageIO.framework/Versions/A/ImageIO.tbd and library file /System/Library/Frameworks//ImageIO.framework/Versions/A/ImageIO are out of sync. Falling back to library file for linking.
ld: warning: text-based stub file /System/Library/Frameworks//ColorSync.framework/Versions/A/ColorSync.tbd and library file /System/Library/Frameworks//ColorSync.framework/Versions/A/ColorSync are out of sync. Falling back to library file for linking.
ld: warning: text-based stub file /System/Library/Frameworks/ApplicationServices.framework/Versions/A/Frameworks/ATS.framework/Versions/A/ATS.tbd and library file /System/Library/Frameworks/ApplicationServices.framework/Versions/A/Frameworks/ATS.framework/Versions/A/ATS are out of sync. Falling back to library file for linking.
ld: warning: text-based stub file /System/Library/Frameworks/ApplicationServices.framework/Versions/A/Frameworks/ColorSyncLegacy.framework/Versions/A/ColorSyncLegacy.tbd and library file /System/Library/Frameworks/ApplicationServices.framework/Versions/A/Frameworks/ColorSyncLegacy.framework/Versions/A/ColorSyncLegacy are out of sync. Falling back to library file for linking.
ld: warning: text-based stub file /System/Library/Frameworks//CoreServices.framework/Versions/A/CoreServices.tbd and library file /System/Library/Frameworks//CoreServices.framework/Versions/A/CoreServices are out of sync. Falling back to library file for linking.
ld: warning: text-based stub file /System/Library/Frameworks/ApplicationServices.framework/Versions/A/Frameworks/HIServices.framework/Versions/A/HIServices.tbd and library file /System/Library/Frameworks/ApplicationServices.framework/Versions/A/Frameworks/HIServices.framework/Versions/A/HIServices are out of sync. Falling back to library file for linking.
ld: warning: text-based stub file /System/Library/Frameworks/ApplicationServices.framework/Versions/A/Frameworks/LangAnalysis.framework/Versions/A/LangAnalysis.tbd and library file /System/Library/Frameworks/ApplicationServices.framework/Versions/A/Frameworks/LangAnalysis.framework/Versions/A/LangAnalysis are out of sync. Falling back to library file for linking.
ld: warning: text-based stub file /System/Library/Frameworks/ApplicationServices.framework/Versions/A/Frameworks/PrintCore.framework/Versions/A/PrintCore.tbd and library file /System/Library/Frameworks/ApplicationServices.framework/Versions/A/Frameworks/PrintCore.framework/Versions/A/PrintCore are out of sync. Falling back to library file for linking.
ld: warning: text-based stub file /System/Library/Frameworks/ApplicationServices.framework/Versions/A/Frameworks/QD.framework/Versions/A/QD.tbd and library file /System/Library/Frameworks/ApplicationServices.framework/Versions/A/Frameworks/QD.framework/Versions/A/QD are out of sync. Falling back to library file for linking.
ld: warning: text-based stub file /System/Library/Frameworks/ApplicationServices.framework/Versions/A/Frameworks/SpeechSynthesis.framework/Versions/A/SpeechSynthesis.tbd and library file /System/Library/Frameworks/ApplicationServices.framework/Versions/A/Frameworks/SpeechSynthesis.framework/Versions/A/SpeechSynthesis are out of sync. Falling back to library file for linking.
ld: warning: text-based stub file /System/Library/Frameworks//AppKit.framework/Versions/C/AppKit.tbd and library file /System/Library/Frameworks//AppKit.framework/Versions/C/AppKit are out of sync. Falling back to library file for linking.
ld: warning: text-based stub file /System/Library/Frameworks//CoreData.framework/Versions/A/CoreData.tbd and library file /System/Library/Frameworks//CoreData.framework/Versions/A/CoreData are out of sync. Falling back to library file for linking.
ld: warning: text-based stub file /System/Library/Frameworks/Carbon.framework/Versions/A/Frameworks/CommonPanels.framework/Versions/A/CommonPanels.tbd and library file /System/Library/Frameworks/Carbon.framework/Versions/A/Frameworks/CommonPanels.framework/Versions/A/CommonPanels are out of sync. Falling back to library file for linking.
ld: warning: text-based stub file /System/Library/Frameworks/Carbon.framework/Versions/A/Frameworks/HIToolbox.framework/Versions/A/HIToolbox.tbd and library file /System/Library/Frameworks/Carbon.framework/Versions/A/Frameworks/HIToolbox.framework/Versions/A/HIToolbox are out of sync. Falling back to library file for linking.
ld: warning: text-based stub file /System/Library/Frameworks/Carbon.framework/Versions/A/Frameworks/Help.framework/Versions/A/Help.tbd and library file /System/Library/Frameworks/Carbon.framework/Versions/A/Frameworks/Help.framework/Versions/A/Help are out of sync. Falling back to library file for linking.
ld: warning: text-based stub file /System/Library/Frameworks/Carbon.framework/Versions/A/Frameworks/ImageCapture.framework/Versions/A/ImageCapture.tbd and library file /System/Library/Frameworks/Carbon.framework/Versions/A/Frameworks/ImageCapture.framework/Versions/A/ImageCapture are out of sync. Falling back to library file for linking.
ld: warning: text-based stub file /System/Library/Frameworks/Carbon.framework/Versions/A/Frameworks/Ink.framework/Versions/A/Ink.tbd and library file /System/Library/Frameworks/Carbon.framework/Versions/A/Frameworks/Ink.framework/Versions/A/Ink are out of sync. Falling back to library file for linking.
ld: warning: text-based stub file /System/Library/Frameworks/Carbon.framework/Versions/A/Frameworks/OpenScripting.framework/Versions/A/OpenScripting.tbd and library file /System/Library/Frameworks/Carbon.framework/Versions/A/Frameworks/OpenScripting.framework/Versions/A/OpenScripting are out of sync. Falling back to library file for linking.
ld: warning: text-based stub file /System/Library/Frameworks/Carbon.framework/Versions/A/Frameworks/Print.framework/Versions/A/Print.tbd and library file /System/Library/Frameworks/Carbon.framework/Versions/A/Frameworks/Print.framework/Versions/A/Print are out of sync. Falling back to library file for linking.
ld: warning: text-based stub file /System/Library/Frameworks/Carbon.framework/Versions/A/Frameworks/SecurityHI.framework/Versions/A/SecurityHI.tbd and library file /System/Library/Frameworks/Carbon.framework/Versions/A/Frameworks/SecurityHI.framework/Versions/A/SecurityHI are out of sync. Falling back to library file for linking.
ld: warning: text-based stub file /System/Library/Frameworks/Carbon.framework/Versions/A/Frameworks/SpeechRecognition.framework/Versions/A/SpeechRecognition.tbd and library file /System/Library/Frameworks/Carbon.framework/Versions/A/Frameworks/SpeechRecognition.framework/Versions/A/SpeechRecognition are out of sync. Falling back to library file for linking.
ld: warning: text-based stub file /System/Library/Frameworks//CoreImage.framework/Versions/A/CoreImage.tbd and library file /System/Library/Frameworks//CoreImage.framework/Versions/A/CoreImage are out of sync. Falling back to library file for linking.
ld: warning: text-based stub file /System/Library/PrivateFrameworks/UIFoundation.framework/Versions/A/UIFoundation.tbd and library file /System/Library/PrivateFrameworks/UIFoundation.framework/Versions/A/UIFoundation are out of sync. Falling back to library file for linking.
ld: warning: text-based stub file /System/Library/Frameworks//Foundation.framework/Versions/C/Foundation.tbd and library file /System/Library/Frameworks//Foundation.framework/Versions/C/Foundation are out of sync. Falling back to library file for linking.
ld: warning: text-based stub file /System/Library/Frameworks//CFNetwork.framework/Versions/A/CFNetwork.tbd and library file /System/Library/Frameworks//CFNetwork.framework/Versions/A/CFNetwork are out of sync. Falling back to library file for linking.
ld: warning: text-based stub file /System/Library/Frameworks/CoreServices.framework/Versions/A/Frameworks/FSEvents.framework/Versions/A/FSEvents.tbd and library file /System/Library/Frameworks/CoreServices.framework/Versions/A/Frameworks/FSEvents.framework/Versions/A/FSEvents are out of sync. Falling back to library file for linking.
ld: warning: text-based stub file /System/Library/Frameworks/CoreServices.framework/Versions/A/Frameworks/CarbonCore.framework/Versions/A/CarbonCore.tbd and library file /System/Library/Frameworks/CoreServices.framework/Versions/A/Frameworks/CarbonCore.framework/Versions/A/CarbonCore are out of sync. Falling back to library file for linking.
ld: warning: text-based stub file /System/Library/Frameworks/CoreServices.framework/Versions/A/Frameworks/Metadata.framework/Versions/A/Metadata.tbd and library file /System/Library/Frameworks/CoreServices.framework/Versions/A/Frameworks/Metadata.framework/Versions/A/Metadata are out of sync. Falling back to library file for linking.
ld: warning: text-based stub file /System/Library/Frameworks/CoreServices.framework/Versions/A/Frameworks/OSServices.framework/Versions/A/OSServices.tbd and library file /System/Library/Frameworks/CoreServices.framework/Versions/A/Frameworks/OSServices.framework/Versions/A/OSServices are out of sync. Falling back to library file for linking.
ld: warning: text-based stub file /System/Library/Frameworks/CoreServices.framework/Versions/A/Frameworks/SearchKit.framework/Versions/A/SearchKit.tbd and library file /System/Library/Frameworks/CoreServices.framework/Versions/A/Frameworks/SearchKit.framework/Versions/A/SearchKit are out of sync. Falling back to library file for linking.
ld: warning: text-based stub file /System/Library/Frameworks/CoreServices.framework/Versions/A/Frameworks/AE.framework/Versions/A/AE.tbd and library file /System/Library/Frameworks/CoreServices.framework/Versions/A/Frameworks/AE.framework/Versions/A/AE are out of sync. Falling back to library file for linking.
ld: warning: text-based stub file /System/Library/Frameworks/CoreServices.framework/Versions/A/Frameworks/LaunchServices.framework/Versions/A/LaunchServices.tbd and library file /System/Library/Frameworks/CoreServices.framework/Versions/A/Frameworks/LaunchServices.framework/Versions/A/LaunchServices are out of sync. Falling back to library file for linking.
ld: warning: text-based stub file /System/Library/Frameworks/CoreServices.framework/Versions/A/Frameworks/DictionaryServices.framework/Versions/A/DictionaryServices.tbd and library file /System/Library/Frameworks/CoreServices.framework/Versions/A/Frameworks/DictionaryServices.framework/Versions/A/DictionaryServices are out of sync. Falling back to library file for linking.
ld: warning: text-based stub file /System/Library/Frameworks/CoreServices.framework/Versions/A/Frameworks/SharedFileList.framework/Versions/A/SharedFileList.tbd and library file /System/Library/Frameworks/CoreServices.framework/Versions/A/Frameworks/SharedFileList.framework/Versions/A/SharedFileList are out of sync. Falling back to library file for linking.
ld: warning: object file (../../../libraries/osx/fmt/lib/libfmt.a(format.cc.o)) was built for newer OSX version (10.13) than being linked (10.12)
ld: warning: text-based stub file /System/Library/Frameworks//CoreFoundation.framework/CoreFoundation.tbd and library file /System/Library/Frameworks//CoreFoundation.framework/CoreFoundation are out of sync. Falling back to library file for linking.
ld: warning: text-based stub file /System/Library/Frameworks//CoreAudio.framework/CoreAudio.tbd and library file /System/Library/Frameworks//CoreAudio.framework/CoreAudio are out of sync. Falling back to library file for linking.
ld: warning: text-based stub file /System/Library/Frameworks//AudioToolbox.framework/AudioToolbox.tbd and library file /System/Library/Frameworks//AudioToolbox.framework/AudioToolbox are out of sync. Falling back to library file for linking.
ld: warning: text-based stub file /System/Library/Frameworks//ForceFeedback.framework/ForceFeedback.tbd and library file /System/Library/Frameworks//ForceFeedback.framework/ForceFeedback are out of sync. Falling back to library file for linking.
ld: warning: text-based stub file /System/Library/Frameworks//CoreVideo.framework/CoreVideo.tbd and library file /System/Library/Frameworks//CoreVideo.framework/CoreVideo are out of sync. Falling back to library file for linking.
ld: warning: text-based stub file /System/Library/Frameworks//Cocoa.framework/Cocoa.tbd and library file /System/Library/Frameworks//Cocoa.framework/Cocoa are out of sync. Falling back to library file for linking.
ld: warning: text-based stub file /System/Library/Frameworks//IOKit.framework/IOKit.tbd and library file /System/Library/Frameworks//IOKit.framework/IOKit are out of sync. Falling back to library file for linking.
ld: warning: text-based stub file /System/Library/Frameworks//QuartzCore.framework/QuartzCore.tbd and library file /System/Library/Frameworks//QuartzCore.framework/QuartzCore are out of sync. Falling back to library file for linking.
ld: warning: text-based stub file /System/Library/Frameworks//Metal.framework/Metal.tbd and library file /System/Library/Frameworks//Metal.framework/Metal are out of sync. Falling back to library file for linking.
ld: warning: text-based stub file /System/Library/Frameworks//Security.framework/Security.tbd and library file /System/Library/Frameworks//Security.framework/Security are out of sync. Falling back to library file for linking.
ld: warning: text-based stub file /System/Library/Frameworks//OpenAL.framework/OpenAL.tbd and library file /System/Library/Frameworks//OpenAL.framework/OpenAL are out of sync. Falling back to library file for linking.
ld: warning: text-based stub file /System/Library/Frameworks//AppKit.framework/Versions/C/AppKit.tbd and library file /System/Library/Frameworks//AppKit.framework/Versions/C/AppKit are out of sync. Falling back to library file for linking.
ld: warning: text-based stub file /System/Library/Frameworks//CoreData.framework/Versions/A/CoreData.tbd and library file /System/Library/Frameworks//CoreData.framework/Versions/A/CoreData are out of sync. Falling back to library file for linking.
ld: warning: text-based stub file /System/Library/Frameworks//ApplicationServices.framework/Versions/A/ApplicationServices.tbd and library file /System/Library/Frameworks//ApplicationServices.framework/Versions/A/ApplicationServices are out of sync. Falling back to library file for linking.
ld: warning: text-based stub file /System/Library/Frameworks/Carbon.framework/Versions/A/Frameworks/CommonPanels.framework/Versions/A/CommonPanels.tbd and library file /System/Library/Frameworks/Carbon.framework/Versions/A/Frameworks/CommonPanels.framework/Versions/A/CommonPanels are out of sync. Falling back to library file for linking.
ld: warning: text-based stub file /System/Library/Frameworks/Carbon.framework/Versions/A/Frameworks/HIToolbox.framework/Versions/A/HIToolbox.tbd and library file /System/Library/Frameworks/Carbon.framework/Versions/A/Frameworks/HIToolbox.framework/Versions/A/HIToolbox are out of sync. Falling back to library file for linking.
ld: warning: text-based stub file /System/Library/Frameworks/Carbon.framework/Versions/A/Frameworks/Help.framework/Versions/A/Help.tbd and library file /System/Library/Frameworks/Carbon.framework/Versions/A/Frameworks/Help.framework/Versions/A/Help are out of sync. Falling back to library file for linking.
ld: warning: text-based stub file /System/Library/Frameworks/Carbon.framework/Versions/A/Frameworks/ImageCapture.framework/Versions/A/ImageCapture.tbd and library file /System/Library/Frameworks/Carbon.framework/Versions/A/Frameworks/ImageCapture.framework/Versions/A/ImageCapture are out of sync. Falling back to library file for linking.
ld: warning: text-based stub file /System/Library/Frameworks/Carbon.framework/Versions/A/Frameworks/Ink.framework/Versions/A/Ink.tbd and library file /System/Library/Frameworks/Carbon.framework/Versions/A/Frameworks/Ink.framework/Versions/A/Ink are out of sync. Falling back to library file for linking.
ld: warning: text-based stub file /System/Library/Frameworks/Carbon.framework/Versions/A/Frameworks/OpenScripting.framework/Versions/A/OpenScripting.tbd and library file /System/Library/Frameworks/Carbon.framework/Versions/A/Frameworks/OpenScripting.framework/Versions/A/OpenScripting are out of sync. Falling back to library file for linking.
ld: warning: text-based stub file /System/Library/Frameworks/Carbon.framework/Versions/A/Frameworks/Print.framework/Versions/A/Print.tbd and library file /System/Library/Frameworks/Carbon.framework/Versions/A/Frameworks/Print.framework/Versions/A/Print are out of sync. Falling back to library file for linking.
ld: warning: text-based stub file /System/Library/Frameworks/Carbon.framework/Versions/A/Frameworks/SecurityHI.framework/Versions/A/SecurityHI.tbd and library file /System/Library/Frameworks/Carbon.framework/Versions/A/Frameworks/SecurityHI.framework/Versions/A/SecurityHI are out of sync. Falling back to library file for linking.
ld: warning: text-based stub file /System/Library/Frameworks/Carbon.framework/Versions/A/Frameworks/SpeechRecognition.framework/Versions/A/SpeechRecognition.tbd and library file /System/Library/Frameworks/Carbon.framework/Versions/A/Frameworks/SpeechRecognition.framework/Versions/A/SpeechRecognition are out of sync. Falling back to library file for linking.
ld: warning: text-based stub file /System/Library/Frameworks//CoreImage.framework/Versions/A/CoreImage.tbd and library file /System/Library/Frameworks//CoreImage.framework/Versions/A/CoreImage are out of sync. Falling back to library file for linking.
ld: warning: text-based stub file /System/Library/PrivateFrameworks/UIFoundation.framework/Versions/A/UIFoundation.tbd and library file /System/Library/PrivateFrameworks/UIFoundation.framework/Versions/A/UIFoundation are out of sync. Falling back to library file for linking.
ld: warning: text-based stub file /System/Library/Frameworks//Foundation.framework/Versions/C/Foundation.tbd and library file /System/Library/Frameworks//Foundation.framework/Versions/C/Foundation are out of sync. Falling back to library file for linking.
ld: warning: text-based stub file /System/Library/Frameworks//CoreGraphics.framework/Versions/A/CoreGraphics.tbd and library file /System/Library/Frameworks//CoreGraphics.framework/Versions/A/CoreGraphics are out of sync. Falling back to library file for linking.
ld: warning: text-based stub file /System/Library/Frameworks//CoreText.framework/Versions/A/CoreText.tbd and library file /System/Library/Frameworks//CoreText.framework/Versions/A/CoreText are out of sync. Falling back to library file for linking.
ld: warning: text-based stub file /System/Library/Frameworks//ImageIO.framework/Versions/A/ImageIO.tbd and library file /System/Library/Frameworks//ImageIO.framework/Versions/A/ImageIO are out of sync. Falling back to library file for linking.
ld: warning: text-based stub file /System/Library/Frameworks//ColorSync.framework/Versions/A/ColorSync.tbd and library file /System/Library/Frameworks//ColorSync.framework/Versions/A/ColorSync are out of sync. Falling back to library file for linking.
ld: warning: text-based stub file /System/Library/Frameworks/ApplicationServices.framework/Versions/A/Frameworks/ATS.framework/Versions/A/ATS.tbd and library file /System/Library/Frameworks/ApplicationServices.framework/Versions/A/Frameworks/ATS.framework/Versions/A/ATS are out of sync. Falling back to library file for linking.
ld: warning: text-based stub file /System/Library/Frameworks/ApplicationServices.framework/Versions/A/Frameworks/ColorSyncLegacy.framework/Versions/A/ColorSyncLegacy.tbd and library file /System/Library/Frameworks/ApplicationServices.framework/Versions/A/Frameworks/ColorSyncLegacy.framework/Versions/A/ColorSyncLegacy are out of sync. Falling back to library file for linking.
ld: warning: text-based stub file /System/Library/Frameworks//CoreServices.framework/Versions/A/CoreServices.tbd and library file /System/Library/Frameworks//CoreServices.framework/Versions/A/CoreServices are out of sync. Falling back to library file for linking.
ld: warning: text-based stub file /System/Library/Frameworks/ApplicationServices.framework/Versions/A/Frameworks/HIServices.framework/Versions/A/HIServices.tbd and library file /System/Library/Frameworks/ApplicationServices.framework/Versions/A/Frameworks/HIServices.framework/Versions/A/HIServices are out of sync. Falling back to library file for linking.
ld: warning: text-based stub file /System/Library/Frameworks/ApplicationServices.framework/Versions/A/Frameworks/LangAnalysis.framework/Versions/A/LangAnalysis.tbd and library file /System/Library/Frameworks/ApplicationServices.framework/Versions/A/Frameworks/LangAnalysis.framework/Versions/A/LangAnalysis are out of sync. Falling back to library file for linking.
ld: warning: text-based stub file /System/Library/Frameworks/ApplicationServices.framework/Versions/A/Frameworks/PrintCore.framework/Versions/A/PrintCore.tbd and library file /System/Library/Frameworks/ApplicationServices.framework/Versions/A/Frameworks/PrintCore.framework/Versions/A/PrintCore are out of sync. Falling back to library file for linking.
ld: warning: text-based stub file /System/Library/Frameworks/ApplicationServices.framework/Versions/A/Frameworks/QD.framework/Versions/A/QD.tbd and library file /System/Library/Frameworks/ApplicationServices.framework/Versions/A/Frameworks/QD.framework/Versions/A/QD are out of sync. Falling back to library file for linking.
ld: warning: text-based stub file /System/Library/Frameworks/ApplicationServices.framework/Versions/A/Frameworks/SpeechSynthesis.framework/Versions/A/SpeechSynthesis.tbd and library file /System/Library/Frameworks/ApplicationServices.framework/Versions/A/Frameworks/SpeechSynthesis.framework/Versions/A/SpeechSynthesis are out of sync. Falling back to library file for linking.
ld: warning: text-based stub file /System/Library/Frameworks//CoreFoundation.framework/Versions/A/CoreFoundation.tbd and library file /System/Library/Frameworks//CoreFoundation.framework/Versions/A/CoreFoundation are out of sync. Falling back to library file for linking.
ld: warning: text-based stub file /System/Library/Frameworks//CFNetwork.framework/Versions/A/CFNetwork.tbd and library file /System/Library/Frameworks//CFNetwork.framework/Versions/A/CFNetwork are out of sync. Falling back to library file for linking.
ld: warning: text-based stub file /System/Library/Frameworks/CoreServices.framework/Versions/A/Frameworks/FSEvents.framework/Versions/A/FSEvents.tbd and library file /System/Library/Frameworks/CoreServices.framework/Versions/A/Frameworks/FSEvents.framework/Versions/A/FSEvents are out of sync. Falling back to library file for linking.
ld: warning: text-based stub file /System/Library/Frameworks/CoreServices.framework/Versions/A/Frameworks/CarbonCore.framework/Versions/A/CarbonCore.tbd and library file /System/Library/Frameworks/CoreServices.framework/Versions/A/Frameworks/CarbonCore.framework/Versions/A/CarbonCore are out of sync. Falling back to library file for linking.
ld: warning: text-based stub file /System/Library/Frameworks/CoreServices.framework/Versions/A/Frameworks/Metadata.framework/Versions/A/Metadata.tbd and library file /System/Library/Frameworks/CoreServices.framework/Versions/A/Frameworks/Metadata.framework/Versions/A/Metadata are out of sync. Falling back to library file for linking.
ld: warning: text-based stub file /System/Library/Frameworks/CoreServices.framework/Versions/A/Frameworks/OSServices.framework/Versions/A/OSServices.tbd and library file /System/Library/Frameworks/CoreServices.framework/Versions/A/Frameworks/OSServices.framework/Versions/A/OSServices are out of sync. Falling back to library file for linking.
ld: warning: text-based stub file /System/Library/Frameworks/CoreServices.framework/Versions/A/Frameworks/SearchKit.framework/Versions/A/SearchKit.tbd and library file /System/Library/Frameworks/CoreServices.framework/Versions/A/Frameworks/SearchKit.framework/Versions/A/SearchKit are out of sync. Falling back to library file for linking.
ld: warning: text-based stub file /System/Library/Frameworks/CoreServices.framework/Versions/A/Frameworks/AE.framework/Versions/A/AE.tbd and library file /System/Library/Frameworks/CoreServices.framework/Versions/A/Frameworks/AE.framework/Versions/A/AE are out of sync. Falling back to library file for linking.
ld: warning: text-based stub file /System/Library/Frameworks/CoreServices.framework/Versions/A/Frameworks/LaunchServices.framework/Versions/A/LaunchServices.tbd and library file /System/Library/Frameworks/CoreServices.framework/Versions/A/Frameworks/LaunchServices.framework/Versions/A/LaunchServices are out of sync. Falling back to library file for linking.
ld: warning: text-based stub file /System/Library/Frameworks/CoreServices.framework/Versions/A/Frameworks/DictionaryServices.framework/Versions/A/DictionaryServices.tbd and library file /System/Library/Frameworks/CoreServices.framework/Versions/A/Frameworks/DictionaryServices.framework/Versions/A/DictionaryServices are out of sync. Falling back to library file for linking.
ld: warning: text-based stub file /System/Library/Frameworks/CoreServices.framework/Versions/A/Frameworks/SharedFileList.framework/Versions/A/SharedFileList.tbd and library file /System/Library/Frameworks/CoreServices.framework/Versions/A/Frameworks/SharedFileList.framework/Versions/A/SharedFileList are out of sync. Falling back to library file for linking.
ld: warning: object file (../../../libraries/osx/fmt/lib/libfmt.a(format.cc.o)) was built for newer OSX version (10.13) than being linked (10.12)
ld: warning: text-based stub file /System/Library/Frameworks//CoreFoundation.framework/CoreFoundation.tbd and library file /System/Library/Frameworks//CoreFoundation.framework/CoreFoundation are out of sync. Falling back to library file for linking.

Link to build: https://jenkins.wildfiregames.com/job/macos-differential/6043/display/redirect

wraitii updated this revision to Diff 20271.May 15 2022, 12:19 PM
wraitii edited the summary of this revision. (Show Details)

For Demo purposes, add a RunThreaded function to run some threaded javascript. This highlights that a web-worker like API is doable, but doing it efficiently would take a little more thought.

Build failure - The Moirai have given mortals hearts that can endure.

builderr-debug-clang7.txt
In file included from ../../../source/simulation2/components/ICmpAIInterface.cpp:22:
In file included from ../../../source/simulation2/system/InterfaceScripted.h:23:
../../../source/scriptinterface/ScriptInterface.h:218:55: error: no template named 'function' in namespace 'std'; did you mean 'fmt::internal::function'?
        void AddPromise(JS::Heap<JSObject*>& promise, Future<std::function<JS::HandleValue(const ScriptRequest&)>>&& future);
                                                             ^~~~~~~~~~~~~
                                                             fmt::internal::function
/usr/include/fmt/format.h:270:8: note: 'fmt::internal::function' declared here
struct function {
       ^
1 error generated.
make[1]: *** [simulation2.make:339: obj/simulation2_Debug/ICmpAIInterface.o] Error 1
make: *** [Makefile:109: simulation2] Error 2
builderr-debug-gcc7.txt
In file included from ../../../source/simulation2/system/InterfaceScripted.h:23,
                 from ../../../source/simulation2/components/ICmpAIInterface.cpp:22:
../../../source/scriptinterface/ScriptInterface.h:218:60: error: 'function' is not a member of 'std'
  void AddPromise(JS::Heap<JSObject*>& promise, Future<std::function<JS::HandleValue(const ScriptRequest&)>>&& future);
                                                            ^~~~~~~~
../../../source/scriptinterface/ScriptInterface.h:218:60: note: 'std::function' is defined in header '<functional>'; did you forget to '#include <functional>'?
../../../source/scriptinterface/ScriptInterface.h:30:1:
+#include <functional>
 
../../../source/scriptinterface/ScriptInterface.h:218:60:
  void AddPromise(JS::Heap<JSObject*>& promise, Future<std::function<JS::HandleValue(const ScriptRequest&)>>&& future);
                                                            ^~~~~~~~
../../../source/scriptinterface/ScriptInterface.h:218:105: error: template argument 1 is invalid
  void AddPromise(JS::Heap<JSObject*>& promise, Future<std::function<JS::HandleValue(const ScriptRequest&)>>&& future);
                                                                                                         ^
../../../source/scriptinterface/ScriptInterface.h:218:60: error: 'function' is not a member of 'std'
  void AddPromise(JS::Heap<JSObject*>& promise, Future<std::function<JS::HandleValue(const ScriptRequest&)>>&& future);
                                                            ^~~~~~~~
../../../source/scriptinterface/ScriptInterface.h:218:60: note: 'std::function' is defined in header '<functional>'; did you forget to '#include <functional>'?
../../../source/scriptinterface/ScriptInterface.h:218:106: error: template argument 1 is invalid
  void AddPromise(JS::Heap<JSObject*>& promise, Future<std::function<JS::HandleValue(const ScriptRequest&)>>&& future);
                                                                                                          ^~
../../../source/scriptinterface/ScriptInterface.h:218:60: error: 'function' is not a member of 'std'
  void AddPromise(JS::Heap<JSObject*>& promise, Future<std::function<JS::HandleValue(const ScriptRequest&)>>&& future);
                                                            ^~~~~~~~
../../../source/scriptinterface/ScriptInterface.h:218:60: note: 'std::function' is defined in header '<functional>'; did you forget to '#include <functional>'?
../../../source/scriptinterface/ScriptInterface.h:218:106: error: template argument 1 is invalid
  void AddPromise(JS::Heap<JSObject*>& promise, Future<std::function<JS::HandleValue(const ScriptRequest&)>>&& future);
                                                                                                          ^~
../../../source/scriptinterface/ScriptInterface.h:218:60: error: 'function' is not a member of 'std'
  void AddPromise(JS::Heap<JSObject*>& promise, Future<std::function<JS::HandleValue(const ScriptRequest&)>>&& future);
                                                            ^~~~~~~~
../../../source/scriptinterface/ScriptInterface.h:218:60: note: 'std::function' is defined in header '<functional>'; did you forget to '#include <functional>'?
../../../source/scriptinterface/ScriptInterface.h:218:106: error: template argument 1 is invalid
  void AddPromise(JS::Heap<JSObject*>& promise, Future<std::function<JS::HandleValue(const ScriptRequest&)>>&& future);
                                                                                                          ^~
../../../source/scriptinterface/ScriptInterface.h:218:48: error: invalid template-id
  void AddPromise(JS::Heap<JSObject*>& promise, Future<std::function<JS::HandleValue(const ScriptRequest&)>>&& future);
                                                ^~~~~~
../../../source/scriptinterface/ScriptInterface.h:218:60: error: 'function' is not a member of 'std'
  void AddPromise(JS::Heap<JSObject*>& promise, Future<std::function<JS::HandleValue(const ScriptRequest&)>>&& future);
                                                            ^~~~~~~~
../../../source/scriptinterface/ScriptInterface.h:218:60: note: 'std::function' is defined in header '<functional>'; did you forget to '#include <functional>'?
../../../source/scriptinterface/ScriptInterface.h:218:84: error: expected primary-expression before '(' token
  void AddPromise(JS::Heap<JSObject*>& promise, Future<std::function<JS::HandleValue(const ScriptRequest&)>>&& future);
                                                                                    ^
../../../source/scriptinterface/ScriptInterface.h:218:85: error: expected primary-expression before 'const'
  void AddPromise(JS::Heap<JSObject*>& promise, Future<std::function<JS::HandleValue(const ScriptRequest&)>>&& future);
                                                                                     ^~~~~
../../../source/scriptinterface/ScriptInterface.h:218:48: error: template placeholder type 'Future' must be followed by a simple declarator-id
  void AddPromise(JS::Heap<JSObject*>& promise, Future<std::function<JS::HandleValue(const ScriptRequest&)>>&& future);
                                                ^~~~~~
In file included from ../../../source/scriptinterface/ScriptInterface.h:27,
                 from ../../../source/simulation2/system/InterfaceScripted.h:23,
                 from ../../../source/simulation2/components/ICmpAIInterface.cpp:22:
../../../source/ps/FutureForward.h:27:7: note: 'template<class Ret> class Future' declared here
 class Future;
       ^~~~~~
In file included from ../../../source/simulation2/system/InterfaceScripted.h:23,
                 from ../../../source/simulation2/components/ICmpAIInterface.cpp:22:
../../../source/scriptinterface/ScriptInterface.h:218:111: error: 'auto' parameter not permitted in this context
  void AddPromise(JS::Heap<JSObject*>& promise, Future<std::function<JS::HandleValue(const ScriptRequest&)>>&& future);
                                                                                                               ^~~~~~
make[1]: *** [simulation2.make:339: obj/simulation2_Debug/ICmpAIInterface.o] Error 1
make: *** [Makefile:109: simulation2] Error 2

Link to build: https://jenkins.wildfiregames.com/job/docker-differential/7740/display/redirect

Build failure - The Moirai have given mortals hearts that can endure.

builderr-debug-macos.txt
/Applications/Xcode.app/Contents/Developer/Toolchains/XcodeDefault.xctoolchain/usr/bin/ranlib: file: ../../../binaries/system/libnetwork_dbg.a(precompiled.o) has no symbols
/Applications/Xcode.app/Contents/Developer/Toolchains/XcodeDefault.xctoolchain/usr/bin/ranlib: file: ../../../binaries/system/liblobby_dbg.a(precompiled.o) has no symbols
/Applications/Xcode.app/Contents/Developer/Toolchains/XcodeDefault.xctoolchain/usr/bin/ranlib: file: ../../../binaries/system/libsimulation2_dbg.a(precompiled.o) has no symbols
/Applications/Xcode.app/Contents/Developer/Toolchains/XcodeDefault.xctoolchain/usr/bin/ranlib: file: ../../../binaries/system/libscriptinterface_dbg.a(precompiled.o) has no symbols
/Applications/Xcode.app/Contents/Developer/Toolchains/XcodeDefault.xctoolchain/usr/bin/ranlib: file: ../../../binaries/system/libengine_dbg.a(precompiled.o) has no symbols
/Applications/Xcode.app/Contents/Developer/Toolchains/XcodeDefault.xctoolchain/usr/bin/ranlib: file: ../../../binaries/system/libgraphics_dbg.a(precompiled.o) has no symbols
/Applications/Xcode.app/Contents/Developer/Toolchains/XcodeDefault.xctoolchain/usr/bin/ranlib: file: ../../../binaries/system/libatlas_dbg.a(precompiled.o) has no symbols
/Applications/Xcode.app/Contents/Developer/Toolchains/XcodeDefault.xctoolchain/usr/bin/ranlib: file: ../../../binaries/system/libgui_dbg.a(precompiled.o) has no symbols
ld: warning: text-based stub file /System/Library/Frameworks//CoreAudio.framework/CoreAudio.tbd and library file /System/Library/Frameworks//CoreAudio.framework/CoreAudio are out of sync. Falling back to library file for linking.
ld: warning: text-based stub file /System/Library/Frameworks//AudioToolbox.framework/AudioToolbox.tbd and library file /System/Library/Frameworks//AudioToolbox.framework/AudioToolbox are out of sync. Falling back to library file for linking.
ld: warning: text-based stub file /System/Library/Frameworks//ForceFeedback.framework/ForceFeedback.tbd and library file /System/Library/Frameworks//ForceFeedback.framework/ForceFeedback are out of sync. Falling back to library file for linking.
ld: warning: text-based stub file /System/Library/Frameworks//CoreVideo.framework/CoreVideo.tbd and library file /System/Library/Frameworks//CoreVideo.framework/CoreVideo are out of sync. Falling back to library file for linking.
ld: warning: text-based stub file /System/Library/Frameworks//Cocoa.framework/Cocoa.tbd and library file /System/Library/Frameworks//Cocoa.framework/Cocoa are out of sync. Falling back to library file for linking.
ld: warning: text-based stub file /System/Library/Frameworks//IOKit.framework/IOKit.tbd and library file /System/Library/Frameworks//IOKit.framework/IOKit are out of sync. Falling back to library file for linking.
ld: warning: text-based stub file /System/Library/Frameworks//QuartzCore.framework/QuartzCore.tbd and library file /System/Library/Frameworks//QuartzCore.framework/QuartzCore are out of sync. Falling back to library file for linking.
ld: warning: text-based stub file /System/Library/Frameworks//Metal.framework/Metal.tbd and library file /System/Library/Frameworks//Metal.framework/Metal are out of sync. Falling back to library file for linking.
ld: warning: text-based stub file /System/Library/Frameworks//Security.framework/Security.tbd and library file /System/Library/Frameworks//Security.framework/Security are out of sync. Falling back to library file for linking.
ld: warning: text-based stub file /System/Library/Frameworks//OpenAL.framework/OpenAL.tbd and library file /System/Library/Frameworks//OpenAL.framework/OpenAL are out of sync. Falling back to library file for linking.
ld: warning: text-based stub file /System/Library/Frameworks//ApplicationServices.framework/ApplicationServices.tbd and library file /System/Library/Frameworks//ApplicationServices.framework/ApplicationServices are out of sync. Falling back to library file for linking.
ld: warning: text-based stub file /System/Library/Frameworks//Cocoa.framework/Cocoa.tbd and library file /System/Library/Frameworks//Cocoa.framework/Cocoa are out of sync. Falling back to library file for linking.
ld: warning: text-based stub file /System/Library/Frameworks//CoreFoundation.framework/CoreFoundation.tbd and library file /System/Library/Frameworks//CoreFoundation.framework/CoreFoundation are out of sync. Falling back to library file for linking.
ld: warning: text-based stub file /System/Library/Frameworks//AppKit.framework/Versions/C/AppKit.tbd and library file /System/Library/Frameworks//AppKit.framework/Versions/C/AppKit are out of sync. Falling back to library file for linking.
ld: warning: text-based stub file /System/Library/Frameworks//CoreData.framework/Versions/A/CoreData.tbd and library file /System/Library/Frameworks//CoreData.framework/Versions/A/CoreData are out of sync. Falling back to library file for linking.
ld: warning: text-based stub file /System/Library/Frameworks/Carbon.framework/Versions/A/Frameworks/CommonPanels.framework/Versions/A/CommonPanels.tbd and library file /System/Library/Frameworks/Carbon.framework/Versions/A/Frameworks/CommonPanels.framework/Versions/A/CommonPanels are out of sync. Falling back to library file for linking.
ld: warning: text-based stub file /System/Library/Frameworks/Carbon.framework/Versions/A/Frameworks/HIToolbox.framework/Versions/A/HIToolbox.tbd and library file /System/Library/Frameworks/Carbon.framework/Versions/A/Frameworks/HIToolbox.framework/Versions/A/HIToolbox are out of sync. Falling back to library file for linking.
ld: warning: text-based stub file /System/Library/Frameworks/Carbon.framework/Versions/A/Frameworks/Help.framework/Versions/A/Help.tbd and library file /System/Library/Frameworks/Carbon.framework/Versions/A/Frameworks/Help.framework/Versions/A/Help are out of sync. Falling back to library file for linking.
ld: warning: text-based stub file /System/Library/Frameworks/Carbon.framework/Versions/A/Frameworks/ImageCapture.framework/Versions/A/ImageCapture.tbd and library file /System/Library/Frameworks/Carbon.framework/Versions/A/Frameworks/ImageCapture.framework/Versions/A/ImageCapture are out of sync. Falling back to library file for linking.
ld: warning: text-based stub file /System/Library/Frameworks/Carbon.framework/Versions/A/Frameworks/Ink.framework/Versions/A/Ink.tbd and library file /System/Library/Frameworks/Carbon.framework/Versions/A/Frameworks/Ink.framework/Versions/A/Ink are out of sync. Falling back to library file for linking.
ld: warning: text-based stub file /System/Library/Frameworks/Carbon.framework/Versions/A/Frameworks/OpenScripting.framework/Versions/A/OpenScripting.tbd and library file /System/Library/Frameworks/Carbon.framework/Versions/A/Frameworks/OpenScripting.framework/Versions/A/OpenScripting are out of sync. Falling back to library file for linking.
ld: warning: text-based stub file /System/Library/Frameworks/Carbon.framework/Versions/A/Frameworks/Print.framework/Versions/A/Print.tbd and library file /System/Library/Frameworks/Carbon.framework/Versions/A/Frameworks/Print.framework/Versions/A/Print are out of sync. Falling back to library file for linking.
ld: warning: text-based stub file /System/Library/Frameworks/Carbon.framework/Versions/A/Frameworks/SecurityHI.framework/Versions/A/SecurityHI.tbd and library file /System/Library/Frameworks/Carbon.framework/Versions/A/Frameworks/SecurityHI.framework/Versions/A/SecurityHI are out of sync. Falling back to library file for linking.
ld: warning: text-based stub file /System/Library/Frameworks/Carbon.framework/Versions/A/Frameworks/SpeechRecognition.framework/Versions/A/SpeechRecognition.tbd and library file /System/Library/Frameworks/Carbon.framework/Versions/A/Frameworks/SpeechRecognition.framework/Versions/A/SpeechRecognition are out of sync. Falling back to library file for linking.
ld: warning: text-based stub file /System/Library/Frameworks//CoreImage.framework/Versions/A/CoreImage.tbd and library file /System/Library/Frameworks//CoreImage.framework/Versions/A/CoreImage are out of sync. Falling back to library file for linking.
ld: warning: text-based stub file /System/Library/Frameworks//CoreGraphics.framework/Versions/A/CoreGraphics.tbd and library file /System/Library/Frameworks//CoreGraphics.framework/Versions/A/CoreGraphics are out of sync. Falling back to library file for linking.
ld: warning: text-based stub file /System/Library/Frameworks//CoreText.framework/Versions/A/CoreText.tbd and library file /System/Library/Frameworks//CoreText.framework/Versions/A/CoreText are out of sync. Falling back to library file for linking.
ld: warning: text-based stub file /System/Library/Frameworks//ImageIO.framework/Versions/A/ImageIO.tbd and library file /System/Library/Frameworks//ImageIO.framework/Versions/A/ImageIO are out of sync. Falling back to library file for linking.
ld: warning: text-based stub file /System/Library/Frameworks//ColorSync.framework/Versions/A/ColorSync.tbd and library file /System/Library/Frameworks//ColorSync.framework/Versions/A/ColorSync are out of sync. Falling back to library file for linking.
ld: warning: text-based stub file /System/Library/Frameworks/ApplicationServices.framework/Versions/A/Frameworks/ATS.framework/Versions/A/ATS.tbd and library file /System/Library/Frameworks/ApplicationServices.framework/Versions/A/Frameworks/ATS.framework/Versions/A/ATS are out of sync. Falling back to library file for linking.
ld: warning: text-based stub file /System/Library/Frameworks/ApplicationServices.framework/Versions/A/Frameworks/ColorSyncLegacy.framework/Versions/A/ColorSyncLegacy.tbd and library file /System/Library/Frameworks/ApplicationServices.framework/Versions/A/Frameworks/ColorSyncLegacy.framework/Versions/A/ColorSyncLegacy are out of sync. Falling back to library file for linking.
ld: warning: text-based stub file /System/Library/Frameworks//CoreServices.framework/Versions/A/CoreServices.tbd and library file /System/Library/Frameworks//CoreServices.framework/Versions/A/CoreServices are out of sync. Falling back to library file for linking.
ld: warning: text-based stub file /System/Library/Frameworks/ApplicationServices.framework/Versions/A/Frameworks/HIServices.framework/Versions/A/HIServices.tbd and library file /System/Library/Frameworks/ApplicationServices.framework/Versions/A/Frameworks/HIServices.framework/Versions/A/HIServices are out of sync. Falling back to library file for linking.
ld: warning: text-based stub file /System/Library/Frameworks/ApplicationServices.framework/Versions/A/Frameworks/LangAnalysis.framework/Versions/A/LangAnalysis.tbd and library file /System/Library/Frameworks/ApplicationServices.framework/Versions/A/Frameworks/LangAnalysis.framework/Versions/A/LangAnalysis are out of sync. Falling back to library file for linking.
ld: warning: text-based stub file /System/Library/Frameworks/ApplicationServices.framework/Versions/A/Frameworks/PrintCore.framework/Versions/A/PrintCore.tbd and library file /System/Library/Frameworks/ApplicationServices.framework/Versions/A/Frameworks/PrintCore.framework/Versions/A/PrintCore are out of sync. Falling back to library file for linking.
ld: warning: text-based stub file /System/Library/Frameworks/ApplicationServices.framework/Versions/A/Frameworks/QD.framework/Versions/A/QD.tbd and library file /System/Library/Frameworks/ApplicationServices.framework/Versions/A/Frameworks/QD.framework/Versions/A/QD are out of sync. Falling back to library file for linking.
ld: warning: text-based stub file /System/Library/Frameworks/ApplicationServices.framework/Versions/A/Frameworks/SpeechSynthesis.framework/Versions/A/SpeechSynthesis.tbd and library file /System/Library/Frameworks/ApplicationServices.framework/Versions/A/Frameworks/SpeechSynthesis.framework/Versions/A/SpeechSynthesis are out of sync. Falling back to library file for linking.
ld: warning: text-based stub file /System/Library/PrivateFrameworks/UIFoundation.framework/Versions/A/UIFoundation.tbd and library file /System/Library/PrivateFrameworks/UIFoundation.framework/Versions/A/UIFoundation are out of sync. Falling back to library file for linking.
ld: warning: text-based stub file /System/Library/Frameworks//Foundation.framework/Versions/C/Foundation.tbd and library file /System/Library/Frameworks//Foundation.framework/Versions/C/Foundation are out of sync. Falling back to library file for linking.
ld: warning: text-based stub file /System/Library/Frameworks//CFNetwork.framework/Versions/A/CFNetwork.tbd and library file /System/Library/Frameworks//CFNetwork.framework/Versions/A/CFNetwork are out of sync. Falling back to library file for linking.
ld: warning: text-based stub file /System/Library/Frameworks/CoreServices.framework/Versions/A/Frameworks/FSEvents.framework/Versions/A/FSEvents.tbd and library file /System/Library/Frameworks/CoreServices.framework/Versions/A/Frameworks/FSEvents.framework/Versions/A/FSEvents are out of sync. Falling back to library file for linking.
ld: warning: text-based stub file /System/Library/Frameworks/CoreServices.framework/Versions/A/Frameworks/CarbonCore.framework/Versions/A/CarbonCore.tbd and library file /System/Library/Frameworks/CoreServices.framework/Versions/A/Frameworks/CarbonCore.framework/Versions/A/CarbonCore are out of sync. Falling back to library file for linking.
ld: warning: text-based stub file /System/Library/Frameworks/CoreServices.framework/Versions/A/Frameworks/Metadata.framework/Versions/A/Metadata.tbd and library file /System/Library/Frameworks/CoreServices.framework/Versions/A/Frameworks/Metadata.framework/Versions/A/Metadata are out of sync. Falling back to library file for linking.
ld: warning: text-based stub file /System/Library/Frameworks/CoreServices.framework/Versions/A/Frameworks/OSServices.framework/Versions/A/OSServices.tbd and library file /System/Library/Frameworks/CoreServices.framework/Versions/A/Frameworks/OSServices.framework/Versions/A/OSServices are out of sync. Falling back to library file for linking.
ld: warning: text-based stub file /System/Library/Frameworks/CoreServices.framework/Versions/A/Frameworks/SearchKit.framework/Versions/A/SearchKit.tbd and library file /System/Library/Frameworks/CoreServices.framework/Versions/A/Frameworks/SearchKit.framework/Versions/A/SearchKit are out of sync. Falling back to library file for linking.
ld: warning: text-based stub file /System/Library/Frameworks/CoreServices.framework/Versions/A/Frameworks/AE.framework/Versions/A/AE.tbd and library file /System/Library/Frameworks/CoreServices.framework/Versions/A/Frameworks/AE.framework/Versions/A/AE are out of sync. Falling back to library file for linking.
ld: warning: text-based stub file /System/Library/Frameworks/CoreServices.framework/Versions/A/Frameworks/LaunchServices.framework/Versions/A/LaunchServices.tbd and library file /System/Library/Frameworks/CoreServices.framework/Versions/A/Frameworks/LaunchServices.framework/Versions/A/LaunchServices are out of sync. Falling back to library file for linking.
ld: warning: text-based stub file /System/Library/Frameworks/CoreServices.framework/Versions/A/Frameworks/DictionaryServices.framework/Versions/A/DictionaryServices.tbd and library file /System/Library/Frameworks/CoreServices.framework/Versions/A/Frameworks/DictionaryServices.framework/Versions/A/DictionaryServices are out of sync. Falling back to library file for linking.
ld: warning: text-based stub file /System/Library/Frameworks/CoreServices.framework/Versions/A/Frameworks/SharedFileList.framework/Versions/A/SharedFileList.tbd and library file /System/Library/Frameworks/CoreServices.framework/Versions/A/Frameworks/SharedFileList.framework/Versions/A/SharedFileList are out of sync. Falling back to library file for linking.
ld: warning: object file (../../../libraries/osx/fmt/lib/libfmt.a(format.cc.o)) was built for newer OSX version (10.13) than being linked (10.12)
ld: warning: text-based stub file /System/Library/Frameworks//CoreFoundation.framework/CoreFoundation.tbd and library file /System/Library/Frameworks//CoreFoundation.framework/CoreFoundation are out of sync. Falling back to library file for linking.
ld: warning: text-based stub file /System/Library/Frameworks//CoreAudio.framework/CoreAudio.tbd and library file /System/Library/Frameworks//CoreAudio.framework/CoreAudio are out of sync. Falling back to library file for linking.
ld: warning: text-based stub file /System/Library/Frameworks//AudioToolbox.framework/AudioToolbox.tbd and library file /System/Library/Frameworks//AudioToolbox.framework/AudioToolbox are out of sync. Falling back to library file for linking.
ld: warning: text-based stub file /System/Library/Frameworks//ForceFeedback.framework/ForceFeedback.tbd and library file /System/Library/Frameworks//ForceFeedback.framework/ForceFeedback are out of sync. Falling back to library file for linking.
ld: warning: text-based stub file /System/Library/Frameworks//CoreVideo.framework/CoreVideo.tbd and library file /System/Library/Frameworks//CoreVideo.framework/CoreVideo are out of sync. Falling back to library file for linking.
ld: warning: text-based stub file /System/Library/Frameworks//Cocoa.framework/Cocoa.tbd and library file /System/Library/Frameworks//Cocoa.framework/Cocoa are out of sync. Falling back to library file for linking.
ld: warning: text-based stub file /System/Library/Frameworks//IOKit.framework/IOKit.tbd and library file /System/Library/Frameworks//IOKit.framework/IOKit are out of sync. Falling back to library file for linking.
ld: warning: text-based stub file /System/Library/Frameworks//QuartzCore.framework/QuartzCore.tbd and library file /System/Library/Frameworks//QuartzCore.framework/QuartzCore are out of sync. Falling back to library file for linking.
ld: warning: text-based stub file /System/Library/Frameworks//Metal.framework/Metal.tbd and library file /System/Library/Frameworks//Metal.framework/Metal are out of sync. Falling back to library file for linking.
ld: warning: text-based stub file /System/Library/Frameworks//Security.framework/Security.tbd and library file /System/Library/Frameworks//Security.framework/Security are out of sync. Falling back to library file for linking.
ld: warning: text-based stub file /System/Library/Frameworks//OpenAL.framework/OpenAL.tbd and library file /System/Library/Frameworks//OpenAL.framework/OpenAL are out of sync. Falling back to library file for linking.
ld: warning: text-based stub file /System/Library/Frameworks//AppKit.framework/Versions/C/AppKit.tbd and library file /System/Library/Frameworks//AppKit.framework/Versions/C/AppKit are out of sync. Falling back to library file for linking.
ld: warning: text-based stub file /System/Library/Frameworks//CoreData.framework/Versions/A/CoreData.tbd and library file /System/Library/Frameworks//CoreData.framework/Versions/A/CoreData are out of sync. Falling back to library file for linking.
ld: warning: text-based stub file /System/Library/Frameworks//ApplicationServices.framework/Versions/A/ApplicationServices.tbd and library file /System/Library/Frameworks//ApplicationServices.framework/Versions/A/ApplicationServices are out of sync. Falling back to library file for linking.
ld: warning: text-based stub file /System/Library/Frameworks/Carbon.framework/Versions/A/Frameworks/CommonPanels.framework/Versions/A/CommonPanels.tbd and library file /System/Library/Frameworks/Carbon.framework/Versions/A/Frameworks/CommonPanels.framework/Versions/A/CommonPanels are out of sync. Falling back to library file for linking.
ld: warning: text-based stub file /System/Library/Frameworks/Carbon.framework/Versions/A/Frameworks/HIToolbox.framework/Versions/A/HIToolbox.tbd and library file /System/Library/Frameworks/Carbon.framework/Versions/A/Frameworks/HIToolbox.framework/Versions/A/HIToolbox are out of sync. Falling back to library file for linking.
ld: warning: text-based stub file /System/Library/Frameworks/Carbon.framework/Versions/A/Frameworks/Help.framework/Versions/A/Help.tbd and library file /System/Library/Frameworks/Carbon.framework/Versions/A/Frameworks/Help.framework/Versions/A/Help are out of sync. Falling back to library file for linking.
ld: warning: text-based stub file /System/Library/Frameworks/Carbon.framework/Versions/A/Frameworks/ImageCapture.framework/Versions/A/ImageCapture.tbd and library file /System/Library/Frameworks/Carbon.framework/Versions/A/Frameworks/ImageCapture.framework/Versions/A/ImageCapture are out of sync. Falling back to library file for linking.
ld: warning: text-based stub file /System/Library/Frameworks/Carbon.framework/Versions/A/Frameworks/Ink.framework/Versions/A/Ink.tbd and library file /System/Library/Frameworks/Carbon.framework/Versions/A/Frameworks/Ink.framework/Versions/A/Ink are out of sync. Falling back to library file for linking.
ld: warning: text-based stub file /System/Library/Frameworks/Carbon.framework/Versions/A/Frameworks/OpenScripting.framework/Versions/A/OpenScripting.tbd and library file /System/Library/Frameworks/Carbon.framework/Versions/A/Frameworks/OpenScripting.framework/Versions/A/OpenScripting are out of sync. Falling back to library file for linking.
ld: warning: text-based stub file /System/Library/Frameworks/Carbon.framework/Versions/A/Frameworks/Print.framework/Versions/A/Print.tbd and library file /System/Library/Frameworks/Carbon.framework/Versions/A/Frameworks/Print.framework/Versions/A/Print are out of sync. Falling back to library file for linking.
ld: warning: text-based stub file /System/Library/Frameworks/Carbon.framework/Versions/A/Frameworks/SecurityHI.framework/Versions/A/SecurityHI.tbd and library file /System/Library/Frameworks/Carbon.framework/Versions/A/Frameworks/SecurityHI.framework/Versions/A/SecurityHI are out of sync. Falling back to library file for linking.
ld: warning: text-based stub file /System/Library/Frameworks/Carbon.framework/Versions/A/Frameworks/SpeechRecognition.framework/Versions/A/SpeechRecognition.tbd and library file /System/Library/Frameworks/Carbon.framework/Versions/A/Frameworks/SpeechRecognition.framework/Versions/A/SpeechRecognition are out of sync. Falling back to library file for linking.
ld: warning: text-based stub file /System/Library/Frameworks//CoreImage.framework/Versions/A/CoreImage.tbd and library file /System/Library/Frameworks//CoreImage.framework/Versions/A/CoreImage are out of sync. Falling back to library file for linking.
ld: warning: text-based stub file /System/Library/PrivateFrameworks/UIFoundation.framework/Versions/A/UIFoundation.tbd and library file /System/Library/PrivateFrameworks/UIFoundation.framework/Versions/A/UIFoundation are out of sync. Falling back to library file for linking.
ld: warning: text-based stub file /System/Library/Frameworks//Foundation.framework/Versions/C/Foundation.tbd and library file /System/Library/Frameworks//Foundation.framework/Versions/C/Foundation are out of sync. Falling back to library file for linking.
ld: warning: text-based stub file /System/Library/Frameworks//CoreGraphics.framework/Versions/A/CoreGraphics.tbd and library file /System/Library/Frameworks//CoreGraphics.framework/Versions/A/CoreGraphics are out of sync. Falling back to library file for linking.
ld: warning: text-based stub file /System/Library/Frameworks//CoreText.framework/Versions/A/CoreText.tbd and library file /System/Library/Frameworks//CoreText.framework/Versions/A/CoreText are out of sync. Falling back to library file for linking.
ld: warning: text-based stub file /System/Library/Frameworks//ImageIO.framework/Versions/A/ImageIO.tbd and library file /System/Library/Frameworks//ImageIO.framework/Versions/A/ImageIO are out of sync. Falling back to library file for linking.
ld: warning: text-based stub file /System/Library/Frameworks//ColorSync.framework/Versions/A/ColorSync.tbd and library file /System/Library/Frameworks//ColorSync.framework/Versions/A/ColorSync are out of sync. Falling back to library file for linking.
ld: warning: text-based stub file /System/Library/Frameworks/ApplicationServices.framework/Versions/A/Frameworks/ATS.framework/Versions/A/ATS.tbd and library file /System/Library/Frameworks/ApplicationServices.framework/Versions/A/Frameworks/ATS.framework/Versions/A/ATS are out of sync. Falling back to library file for linking.
ld: warning: text-based stub file /System/Library/Frameworks/ApplicationServices.framework/Versions/A/Frameworks/ColorSyncLegacy.framework/Versions/A/ColorSyncLegacy.tbd and library file /System/Library/Frameworks/ApplicationServices.framework/Versions/A/Frameworks/ColorSyncLegacy.framework/Versions/A/ColorSyncLegacy are out of sync. Falling back to library file for linking.
ld: warning: text-based stub file /System/Library/Frameworks//CoreServices.framework/Versions/A/CoreServices.tbd and library file /System/Library/Frameworks//CoreServices.framework/Versions/A/CoreServices are out of sync. Falling back to library file for linking.
ld: warning: text-based stub file /System/Library/Frameworks/ApplicationServices.framework/Versions/A/Frameworks/HIServices.framework/Versions/A/HIServices.tbd and library file /System/Library/Frameworks/ApplicationServices.framework/Versions/A/Frameworks/HIServices.framework/Versions/A/HIServices are out of sync. Falling back to library file for linking.
ld: warning: text-based stub file /System/Library/Frameworks/ApplicationServices.framework/Versions/A/Frameworks/LangAnalysis.framework/Versions/A/LangAnalysis.tbd and library file /System/Library/Frameworks/ApplicationServices.framework/Versions/A/Frameworks/LangAnalysis.framework/Versions/A/LangAnalysis are out of sync. Falling back to library file for linking.
ld: warning: text-based stub file /System/Library/Frameworks/ApplicationServices.framework/Versions/A/Frameworks/PrintCore.framework/Versions/A/PrintCore.tbd and library file /System/Library/Frameworks/ApplicationServices.framework/Versions/A/Frameworks/PrintCore.framework/Versions/A/PrintCore are out of sync. Falling back to library file for linking.
ld: warning: text-based stub file /System/Library/Frameworks/ApplicationServices.framework/Versions/A/Frameworks/QD.framework/Versions/A/QD.tbd and library file /System/Library/Frameworks/ApplicationServices.framework/Versions/A/Frameworks/QD.framework/Versions/A/QD are out of sync. Falling back to library file for linking.
ld: warning: text-based stub file /System/Library/Frameworks/ApplicationServices.framework/Versions/A/Frameworks/SpeechSynthesis.framework/Versions/A/SpeechSynthesis.tbd and library file /System/Library/Frameworks/ApplicationServices.framework/Versions/A/Frameworks/SpeechSynthesis.framework/Versions/A/SpeechSynthesis are out of sync. Falling back to library file for linking.
ld: warning: text-based stub file /System/Library/Frameworks//CoreFoundation.framework/Versions/A/CoreFoundation.tbd and library file /System/Library/Frameworks//CoreFoundation.framework/Versions/A/CoreFoundation are out of sync. Falling back to library file for linking.
ld: warning: text-based stub file /System/Library/Frameworks//CFNetwork.framework/Versions/A/CFNetwork.tbd and library file /System/Library/Frameworks//CFNetwork.framework/Versions/A/CFNetwork are out of sync. Falling back to library file for linking.
ld: warning: text-based stub file /System/Library/Frameworks/CoreServices.framework/Versions/A/Frameworks/FSEvents.framework/Versions/A/FSEvents.tbd and library file /System/Library/Frameworks/CoreServices.framework/Versions/A/Frameworks/FSEvents.framework/Versions/A/FSEvents are out of sync. Falling back to library file for linking.
ld: warning: text-based stub file /System/Library/Frameworks/CoreServices.framework/Versions/A/Frameworks/CarbonCore.framework/Versions/A/CarbonCore.tbd and library file /System/Library/Frameworks/CoreServices.framework/Versions/A/Frameworks/CarbonCore.framework/Versions/A/CarbonCore are out of sync. Falling back to library file for linking.
ld: warning: text-based stub file /System/Library/Frameworks/CoreServices.framework/Versions/A/Frameworks/Metadata.framework/Versions/A/Metadata.tbd and library file /System/Library/Frameworks/CoreServices.framework/Versions/A/Frameworks/Metadata.framework/Versions/A/Metadata are out of sync. Falling back to library file for linking.
ld: warning: text-based stub file /System/Library/Frameworks/CoreServices.framework/Versions/A/Frameworks/OSServices.framework/Versions/A/OSServices.tbd and library file /System/Library/Frameworks/CoreServices.framework/Versions/A/Frameworks/OSServices.framework/Versions/A/OSServices are out of sync. Falling back to library file for linking.
ld: warning: text-based stub file /System/Library/Frameworks/CoreServices.framework/Versions/A/Frameworks/SearchKit.framework/Versions/A/SearchKit.tbd and library file /System/Library/Frameworks/CoreServices.framework/Versions/A/Frameworks/SearchKit.framework/Versions/A/SearchKit are out of sync. Falling back to library file for linking.
ld: warning: text-based stub file /System/Library/Frameworks/CoreServices.framework/Versions/A/Frameworks/AE.framework/Versions/A/AE.tbd and library file /System/Library/Frameworks/CoreServices.framework/Versions/A/Frameworks/AE.framework/Versions/A/AE are out of sync. Falling back to library file for linking.
ld: warning: text-based stub file /System/Library/Frameworks/CoreServices.framework/Versions/A/Frameworks/LaunchServices.framework/Versions/A/LaunchServices.tbd and library file /System/Library/Frameworks/CoreServices.framework/Versions/A/Frameworks/LaunchServices.framework/Versions/A/LaunchServices are out of sync. Falling back to library file for linking.
ld: warning: text-based stub file /System/Library/Frameworks/CoreServices.framework/Versions/A/Frameworks/DictionaryServices.framework/Versions/A/DictionaryServices.tbd and library file /System/Library/Frameworks/CoreServices.framework/Versions/A/Frameworks/DictionaryServices.framework/Versions/A/DictionaryServices are out of sync. Falling back to library file for linking.
ld: warning: text-based stub file /System/Library/Frameworks/CoreServices.framework/Versions/A/Frameworks/SharedFileList.framework/Versions/A/SharedFileList.tbd and library file /System/Library/Frameworks/CoreServices.framework/Versions/A/Frameworks/SharedFileList.framework/Versions/A/SharedFileList are out of sync. Falling back to library file for linking.
ld: warning: object file (../../../libraries/osx/fmt/lib/libfmt.a(format.cc.o)) was built for newer OSX version (10.13) than being linked (10.12)
ld: warning: text-based stub file /System/Library/Frameworks//CoreFoundation.framework/CoreFoundation.tbd and library file /System/Library/Frameworks//CoreFoundation.framework/CoreFoundation are out of sync. Falling back to library file for linking.

Link to build: https://jenkins.wildfiregames.com/job/macos-differential/6044/display/redirect

Build failure - The Moirai have given mortals hearts that can endure.

Debug:
    12>e:\jenkins\workspace\vs2015-differential\libraries\source\spidermonkey\include-win32-debug\js\promise.h(255): warning C4251: 'JS::AutoDebuggerJobQueueInterruption::_mCheckNotUsedAsTemporary': class 'mozilla::detail::GuardObjectNotificationReceiver' needs to have dll-interface to be used by clients of class 'JS::AutoDebuggerJobQueueInterruption' (compiling source file ..\..\..\source\scriptinterface\ScriptContext.cpp) [E:\Jenkins\workspace\vs2015-differential\build\workspaces\vs2017\scriptinterface.vcxproj]
    12>e:\jenkins\workspace\vs2015-differential\libraries\source\spidermonkey\include-win32-debug\js\promise.h(257): warning C4251: 'JS::AutoDebuggerJobQueueInterruption::saved': class 'mozilla::UniquePtr<JS::JobQueue::SavedJobQueue,JS::DeletePolicy<T>>' needs to have dll-interface to be used by clients of class 'JS::AutoDebuggerJobQueueInterruption' [E:\Jenkins\workspace\vs2015-differential\build\workspaces\vs2017\scriptinterface.vcxproj]
    12>e:\jenkins\workspace\vs2015-differential\libraries\source\spidermonkey\include-win32-debug\js\promise.h(255): warning C4251: 'JS::AutoDebuggerJobQueueInterruption::_mCheckNotUsedAsTemporary': class 'mozilla::detail::GuardObjectNotificationReceiver' needs to have dll-interface to be used by clients of class 'JS::AutoDebuggerJobQueueInterruption' (compiling source file ..\..\..\source\scriptinterface\ScriptInterface.cpp) [E:\Jenkins\workspace\vs2015-differential\build\workspaces\vs2017\scriptinterface.vcxproj]
    12>e:\jenkins\workspace\vs2015-differential\libraries\source\spidermonkey\include-win32-debug\js\promise.h(257): warning C4251: 'JS::AutoDebuggerJobQueueInterruption::saved': class 'mozilla::UniquePtr<JS::JobQueue::SavedJobQueue,JS::DeletePolicy<T>>' needs to have dll-interface to be used by clients of class 'JS::AutoDebuggerJobQueueInterruption' [E:\Jenkins\workspace\vs2015-differential\build\workspaces\vs2017\scriptinterface.vcxproj]
    23>e:\jenkins\workspace\vs2015-differential\libraries\source\spidermonkey\include-win32-debug\js\promise.h(255): warning C4251: 'JS::AutoDebuggerJobQueueInterruption::_mCheckNotUsedAsTemporary': class 'mozilla::detail::GuardObjectNotificationReceiver' needs to have dll-interface to be used by clients of class 'JS::AutoDebuggerJobQueueInterruption' (compiling source file ..\..\..\source\scriptinterface\tests\test_Promises.cpp) [E:\Jenkins\workspace\vs2015-differential\build\workspaces\vs2017\test.vcxproj]
    23>e:\jenkins\workspace\vs2015-differential\libraries\source\spidermonkey\include-win32-debug\js\promise.h(257): warning C4251: 'JS::AutoDebuggerJobQueueInterruption::saved': class 'mozilla::UniquePtr<JS::JobQueue::SavedJobQueue,JS::DeletePolicy<T>>' needs to have dll-interface to be used by clients of class 'JS::AutoDebuggerJobQueueInterruption' [E:\Jenkins\workspace\vs2015-differential\build\workspaces\vs2017\test.vcxproj]
Release:
    12>e:\jenkins\workspace\vs2015-differential\libraries\source\spidermonkey\include-win32-release\js\promise.h(257): warning C4251: 'JS::AutoDebuggerJobQueueInterruption::saved': class 'mozilla::UniquePtr<JS::JobQueue::SavedJobQueue,JS::DeletePolicy<T>>' needs to have dll-interface to be used by clients of class 'JS::AutoDebuggerJobQueueInterruption' [E:\Jenkins\workspace\vs2015-differential\build\workspaces\vs2017\scriptinterface.vcxproj]
    12>e:\jenkins\workspace\vs2015-differential\libraries\source\spidermonkey\include-win32-release\js\promise.h(257): warning C4251: 'JS::AutoDebuggerJobQueueInterruption::saved': class 'mozilla::UniquePtr<JS::JobQueue::SavedJobQueue,JS::DeletePolicy<T>>' needs to have dll-interface to be used by clients of class 'JS::AutoDebuggerJobQueueInterruption' [E:\Jenkins\workspace\vs2015-differential\build\workspaces\vs2017\scriptinterface.vcxproj]
    23>e:\jenkins\workspace\vs2015-differential\libraries\source\spidermonkey\include-win32-release\js\promise.h(257): warning C4251: 'JS::AutoDebuggerJobQueueInterruption::saved': class 'mozilla::UniquePtr<JS::JobQueue::SavedJobQueue,JS::DeletePolicy<T>>' needs to have dll-interface to be used by clients of class 'JS::AutoDebuggerJobQueueInterruption' [E:\Jenkins\workspace\vs2015-differential\build\workspaces\vs2017\test.vcxproj]

Link to build: https://jenkins.wildfiregames.com/job/vs2015-differential/7134/display/redirect