Page MenuHomeWildfire Games

ParamNode extension
Changes PlannedPublic

Authored by wraitii on Apr 10 2021, 4:32 PM.

Details

Reviewers
None
Summary

Extends ParamNode:

  • Each node can have multiple children with the same name
  • Nodes are stored in the loading order
  • ParamNode can be created from Javascript objects.
  • Guarantees that attributes are placed first

The intention is to be able to load GUI XML files into ParamNode, anticipating D3823.

Other changes:

  • To support the above, std::vector is used in place of std::map and the node name is moved to a member. This is likely to be equivalent or faster in random access efficiency, given that there are generally few children to a paramnode.
  • Some implementation details are moved to a friend function to make incremental recompilation faster & hide them from the interface.
  • Some streamlining in ApplyLayer to make the control flow more obvious
  • Split some functions
  • Allow overwriting values when using merge="".

The slowdown from unordered_map counting children in ApplyLayer is not significant compared to the gains in D3834 & this remains very fast overall.

TODO:

  • JS attribute parsing doesn't guarantee that they're put first.

TODO after the patch:

  • Move the ParamNode header to source/ps/
  • Make HandleTokens more efficient
  • Would be good to implement more stuff in JS.
  • Would be good to allow loading XML without 'applying' it.
Test Plan

Compile, test.

Event Timeline

wraitii created this revision.Apr 10 2021, 4:32 PM
Owners added a subscriber: Restricted Owners Package.Apr 10 2021, 4:32 PM

Build failure - The Moirai have given mortals hearts that can endure.

builderr-debug-macos.txt
/Applications/Xcode.app/Contents/Developer/Toolchains/XcodeDefault.xctoolchain/usr/bin/ranlib: file: ../../../binaries/system/liblobby_dbg.a(precompiled.o) has no symbols
/Applications/Xcode.app/Contents/Developer/Toolchains/XcodeDefault.xctoolchain/usr/bin/ranlib: file: ../../../binaries/system/libsimulation2_dbg.a(precompiled.o) has no symbols
/Applications/Xcode.app/Contents/Developer/Toolchains/XcodeDefault.xctoolchain/usr/bin/ranlib: file: ../../../binaries/system/libscriptinterface_dbg.a(precompiled.o) has no symbols
../../../source/ps/CStrIntern.cpp:104:43: warning: unused parameter 'context' [-Wunused-parameter]
CStrIntern::CStrIntern(CStrInternContext& context)
                                          ^
../../../source/ps/CStrIntern.cpp:109:60: warning: unused parameter 'context' [-Wunused-parameter]
CStrIntern::CStrIntern(const char* str, CStrInternContext& context)
                                                           ^
../../../source/ps/CStrIntern.cpp:114:67: warning: unused parameter 'context' [-Wunused-parameter]
CStrIntern::CStrIntern(const std::string& str, CStrInternContext& context)
                                                                  ^
3 warnings generated.
/Applications/Xcode.app/Contents/Developer/Toolchains/XcodeDefault.xctoolchain/usr/bin/ranlib: file: ../../../binaries/system/libengine_dbg.a(precompiled.o) has no symbols
../../../source/graphics/ShaderProgram.cpp:86:15: warning: 'Reload' overrides a member function but is not marked 'override' [-Winconsistent-missing-override]
        virtual void Reload()
                     ^
../../../source/graphics/ShaderProgram.h:124:15: note: overridden virtual function is here
        virtual void Reload() = 0;
                     ^
../../../source/graphics/ShaderProgram.cpp:118:15: warning: 'Bind' overrides a member function but is not marked 'override' [-Winconsistent-missing-override]
        virtual void Bind()
                     ^
../../../source/graphics/ShaderProgram.h:135:15: note: overridden virtual function is here
        virtual void Bind() = 0;
                     ^
../../../source/graphics/ShaderProgram.cpp:128:15: warning: 'Unbind' overrides a member function but is not marked 'override' [-Winconsistent-missing-override]
        virtual void Unbind()
                     ^
../../../source/graphics/ShaderProgram.h:140:15: note: overridden virtual function is here
        virtual void Unbind() = 0;
                     ^
../../../source/graphics/ShaderProgram.cpp:156:18: warning: 'GetTextureBinding' overrides a member function but is not marked 'override' [-Winconsistent-missing-override]
        virtual Binding GetTextureBinding(texture_id_t id)
                        ^
../../../source/graphics/ShaderProgram.h:149:18: note: overridden virtual function is here
        virtual Binding GetTextureBinding(texture_id_t id) = 0;
                        ^
../../../source/graphics/ShaderProgram.cpp:166:15: warning: 'BindTexture' overrides a member function but is not marked 'override' [-Winconsistent-missing-override]
        virtual void BindTexture(texture_id_t id, Handle tex)
                     ^
../../../source/graphics/ShaderProgram.h:153:15: note: overridden virtual function is here
        virtual void BindTexture(texture_id_t id, Handle tex) = 0;
                     ^
../../../source/graphics/ShaderProgram.cpp:179:15: warning: 'BindTexture' overrides a member function but is not marked 'override' [-Winconsistent-missing-override]
        virtual void BindTexture(texture_id_t id, GLuint tex)
                     ^
../../../source/graphics/ShaderProgram.h:154:15: note: overridden virtual function is here
        virtual void BindTexture(texture_id_t id, GLuint tex) = 0;
                     ^
../../../source/graphics/ShaderProgram.cpp:190:15: warning: 'BindTexture' overrides a member function but is not marked 'override' [-Winconsistent-missing-override]
        virtual void BindTexture(Binding id, Handle tex)
                     ^
../../../source/graphics/ShaderProgram.h:155:15: note: overridden virtual function is here
        virtual void BindTexture(Binding id, Handle tex) = 0;
                     ^
../../../source/graphics/ShaderProgram.cpp:197:18: warning: 'GetUniformBinding' overrides a member function but is not marked 'override' [-Winconsistent-missing-override]
        virtual Binding GetUniformBinding(uniform_id_t id)
                        ^
../../../source/graphics/ShaderProgram.h:158:18: note: overridden virtual function is here
        virtual Binding GetUniformBinding(uniform_id_t id) = 0;
                        ^
../../../source/graphics/ShaderProgram.cpp:202:15: warning: 'Uniform' overrides a member function but is not marked 'override' [-Winconsistent-missing-override]
        virtual void Uniform(Binding id, float v0, float v1, float v2, float v3)
                     ^
../../../source/graphics/ShaderProgram.h:161:15: note: overridden virtual function is here
        virtual void Uniform(Binding id, float v0, float v1, float v2, float v3) = 0;
                     ^
../../../source/graphics/ShaderProgram.cpp:211:15: warning: 'Uniform' overrides a member function but is not marked 'override' [-Winconsistent-missing-override]
        virtual void Uniform(Binding id, const CMatrix3D& v)
                     ^
../../../source/graphics/ShaderProgram.h:162:15: note: overridden virtual function is here
        virtual void Uniform(Binding id, const CMatrix3D& v) = 0;
                     ^
../../../source/graphics/ShaderProgram.cpp:230:15: warning: 'Uniform' overrides a member function but is not marked 'override' [-Winconsistent-missing-override]
        virtual void Uniform(Binding id, size_t count, const CMatrix3D* v)
                     ^
../../../source/graphics/ShaderProgram.h:163:15: note: overridden virtual function is here
        virtual void Uniform(Binding id, size_t count, const CMatrix3D* v) = 0;
                     ^
../../../source/graphics/ShaderProgram.cpp:236:15: warning: 'Uniform' overrides a member function but is not marked 'override' [-Winconsistent-missing-override]
        virtual void Uniform(Binding id, size_t count, const float* v)
                     ^
../../../source/graphics/ShaderProgram.h:164:15: note: overridden virtual function is here
        virtual void Uniform(Binding id, size_t count, const float* v) = 0;
                     ^
12 warnings generated.
/Applications/Xcode.app/Contents/Developer/Toolchains/XcodeDefault.xctoolchain/usr/bin/ranlib: file: ../../../binaries/system/libgraphics_dbg.a(precompiled.o) has no symbols
/Applications/Xcode.app/Contents/Developer/Toolchains/XcodeDefault.xctoolchain/usr/bin/ranlib: file: ../../../binaries/system/libatlas_dbg.a(precompiled.o) has no symbols
/Applications/Xcode.app/Contents/Developer/Toolchains/XcodeDefault.xctoolchain/usr/bin/ranlib: file: ../../../binaries/system/libgui_dbg.a(precompiled.o) has no symbols
ld: warning: text-based stub file /System/Library/Frameworks//CoreAudio.framework/CoreAudio.tbd and library file /System/Library/Frameworks//CoreAudio.framework/CoreAudio are out of sync. Falling back to library file for linking.
ld: warning: text-based stub file /System/Library/Frameworks//AudioToolbox.framework/AudioToolbox.tbd and library file /System/Library/Frameworks//AudioToolbox.framework/AudioToolbox are out of sync. Falling back to library file for linking.
ld: warning: text-based stub file /System/Library/Frameworks//ForceFeedback.framework/ForceFeedback.tbd and library file /System/Library/Frameworks//ForceFeedback.framework/ForceFeedback are out of sync. Falling back to library file for linking.
ld: warning: text-based stub file /System/Library/Frameworks//CoreVideo.framework/CoreVideo.tbd and library file /System/Library/Frameworks//CoreVideo.framework/CoreVideo are out of sync. Falling back to library file for linking.
ld: warning: text-based stub file /System/Library/Frameworks//Cocoa.framework/Cocoa.tbd and library file /System/Library/Frameworks//Cocoa.framework/Cocoa are out of sync. Falling back to library file for linking.
ld: warning: text-based stub file /System/Library/Frameworks//IOKit.framework/IOKit.tbd and library file /System/Library/Frameworks//IOKit.framework/IOKit are out of sync. Falling back to library file for linking.
ld: warning: text-based stub file /System/Library/Frameworks//QuartzCore.framework/QuartzCore.tbd and library file /System/Library/Frameworks//QuartzCore.framework/QuartzCore are out of sync. Falling back to library file for linking.
ld: warning: text-based stub file /System/Library/Frameworks//Metal.framework/Metal.tbd and library file /System/Library/Frameworks//Metal.framework/Metal are out of sync. Falling back to library file for linking.
ld: warning: text-based stub file /System/Library/Frameworks//OpenGL.framework/OpenGL.tbd and library file /System/Library/Frameworks//OpenGL.framework/OpenGL are out of sync. Falling back to library file for linking.
ld: warning: text-based stub file /System/Library/Frameworks//Security.framework/Security.tbd and library file /System/Library/Frameworks//Security.framework/Security are out of sync. Falling back to library file for linking.
ld: warning: text-based stub file /System/Library/Frameworks//OpenAL.framework/OpenAL.tbd and library file /System/Library/Frameworks//OpenAL.framework/OpenAL are out of sync. Falling back to library file for linking.
ld: warning: text-based stub file /System/Library/Frameworks//ApplicationServices.framework/ApplicationServices.tbd and library file /System/Library/Frameworks//ApplicationServices.framework/ApplicationServices are out of sync. Falling back to library file for linking.
ld: warning: text-based stub file /System/Library/Frameworks//Cocoa.framework/Cocoa.tbd and library file /System/Library/Frameworks//Cocoa.framework/Cocoa are out of sync. Falling back to library file for linking.
ld: warning: text-based stub file /System/Library/Frameworks//CoreFoundation.framework/CoreFoundation.tbd and library file /System/Library/Frameworks//CoreFoundation.framework/CoreFoundation are out of sync. Falling back to library file for linking.
ld: warning: text-based stub file /System/Library/Frameworks//AppKit.framework/Versions/C/AppKit.tbd and library file /System/Library/Frameworks//AppKit.framework/Versions/C/AppKit are out of sync. Falling back to library file for linking.
ld: warning: text-based stub file /System/Library/Frameworks//CoreData.framework/Versions/A/CoreData.tbd and library file /System/Library/Frameworks//CoreData.framework/Versions/A/CoreData are out of sync. Falling back to library file for linking.
ld: warning: text-based stub file /System/Library/Frameworks/Carbon.framework/Versions/A/Frameworks/CommonPanels.framework/Versions/A/CommonPanels.tbd and library file /System/Library/Frameworks/Carbon.framework/Versions/A/Frameworks/CommonPanels.framework/Versions/A/CommonPanels are out of sync. Falling back to library file for linking.
ld: warning: text-based stub file /System/Library/Frameworks/Carbon.framework/Versions/A/Frameworks/HIToolbox.framework/Versions/A/HIToolbox.tbd and library file /System/Library/Frameworks/Carbon.framework/Versions/A/Frameworks/HIToolbox.framework/Versions/A/HIToolbox are out of sync. Falling back to library file for linking.
ld: warning: text-based stub file /System/Library/Frameworks/Carbon.framework/Versions/A/Frameworks/Help.framework/Versions/A/Help.tbd and library file /System/Library/Frameworks/Carbon.framework/Versions/A/Frameworks/Help.framework/Versions/A/Help are out of sync. Falling back to library file for linking.
ld: warning: text-based stub file /System/Library/Frameworks/Carbon.framework/Versions/A/Frameworks/ImageCapture.framework/Versions/A/ImageCapture.tbd and library file /System/Library/Frameworks/Carbon.framework/Versions/A/Frameworks/ImageCapture.framework/Versions/A/ImageCapture are out of sync. Falling back to library file for linking.
ld: warning: text-based stub file /System/Library/Frameworks/Carbon.framework/Versions/A/Frameworks/Ink.framework/Versions/A/Ink.tbd and library file /System/Library/Frameworks/Carbon.framework/Versions/A/Frameworks/Ink.framework/Versions/A/Ink are out of sync. Falling back to library file for linking.
ld: warning: text-based stub file /System/Library/Frameworks/Carbon.framework/Versions/A/Frameworks/OpenScripting.framework/Versions/A/OpenScripting.tbd and library file /System/Library/Frameworks/Carbon.framework/Versions/A/Frameworks/OpenScripting.framework/Versions/A/OpenScripting are out of sync. Falling back to library file for linking.
ld: warning: text-based stub file /System/Library/Frameworks/Carbon.framework/Versions/A/Frameworks/Print.framework/Versions/A/Print.tbd and library file /System/Library/Frameworks/Carbon.framework/Versions/A/Frameworks/Print.framework/Versions/A/Print are out of sync. Falling back to library file for linking.
ld: warning: text-based stub file /System/Library/Frameworks/Carbon.framework/Versions/A/Frameworks/SecurityHI.framework/Versions/A/SecurityHI.tbd and library file /System/Library/Frameworks/Carbon.framework/Versions/A/Frameworks/SecurityHI.framework/Versions/A/SecurityHI are out of sync. Falling back to library file for linking.
ld: warning: text-based stub file /System/Library/Frameworks/Carbon.framework/Versions/A/Frameworks/SpeechRecognition.framework/Versions/A/SpeechRecognition.tbd and library file /System/Library/Frameworks/Carbon.framework/Versions/A/Frameworks/SpeechRecognition.framework/Versions/A/SpeechRecognition are out of sync. Falling back to library file for linking.
ld: warning: text-based stub file /System/Library/Frameworks//CoreImage.framework/Versions/A/CoreImage.tbd and library file /System/Library/Frameworks//CoreImage.framework/Versions/A/CoreImage are out of sync. Falling back to library file for linking.
ld: warning: text-based stub file /System/Library/Frameworks/OpenGL.framework/Versions/A/Libraries/libGLU.tbd and library file /System/Library/Frameworks/OpenGL.framework/Versions/A/Libraries/libGLU.dylib are out of sync. Falling back to library file for linking.
ld: warning: text-based stub file /System/Library/Frameworks/OpenGL.framework/Versions/A/Libraries/libGL.tbd and library file /System/Library/Frameworks/OpenGL.framework/Versions/A/Libraries/libGL.dylib are out of sync. Falling back to library file for linking.
ld: warning: text-based stub file /System/Library/Frameworks//CoreGraphics.framework/Versions/A/CoreGraphics.tbd and library file /System/Library/Frameworks//CoreGraphics.framework/Versions/A/CoreGraphics are out of sync. Falling back to library file for linking.
ld: warning: text-based stub file /System/Library/Frameworks//CoreText.framework/Versions/A/CoreText.tbd and library file /System/Library/Frameworks//CoreText.framework/Versions/A/CoreText are out of sync. Falling back to library file for linking.
ld: warning: text-based stub file /System/Library/Frameworks//ImageIO.framework/Versions/A/ImageIO.tbd and library file /System/Library/Frameworks//ImageIO.framework/Versions/A/ImageIO are out of sync. Falling back to library file for linking.
ld: warning: text-based stub file /System/Library/Frameworks//ColorSync.framework/Versions/A/ColorSync.tbd and library file /System/Library/Frameworks//ColorSync.framework/Versions/A/ColorSync are out of sync. Falling back to library file for linking.
ld: warning: text-based stub file /System/Library/Frameworks/ApplicationServices.framework/Versions/A/Frameworks/ATS.framework/Versions/A/ATS.tbd and library file /System/Library/Frameworks/ApplicationServices.framework/Versions/A/Frameworks/ATS.framework/Versions/A/ATS are out of sync. Falling back to library file for linking.
ld: warning: text-based stub file /System/Library/Frameworks/ApplicationServices.framework/Versions/A/Frameworks/ColorSyncLegacy.framework/Versions/A/ColorSyncLegacy.tbd and library file /System/Library/Frameworks/ApplicationServices.framework/Versions/A/Frameworks/ColorSyncLegacy.framework/Versions/A/ColorSyncLegacy are out of sync. Falling back to library file for linking.
ld: warning: text-based stub file /System/Library/Frameworks//CoreServices.framework/Versions/A/CoreServices.tbd and library file /System/Library/Frameworks//CoreServices.framework/Versions/A/CoreServices are out of sync. Falling back to library file for linking.
ld: warning: text-based stub file /System/Library/Frameworks/ApplicationServices.framework/Versions/A/Frameworks/HIServices.framework/Versions/A/HIServices.tbd and library file /System/Library/Frameworks/ApplicationServices.framework/Versions/A/Frameworks/HIServices.framework/Versions/A/HIServices are out of sync. Falling back to library file for linking.
ld: warning: text-based stub file /System/Library/Frameworks/ApplicationServices.framework/Versions/A/Frameworks/LangAnalysis.framework/Versions/A/LangAnalysis.tbd and library file /System/Library/Frameworks/ApplicationServices.framework/Versions/A/Frameworks/LangAnalysis.framework/Versions/A/LangAnalysis are out of sync. Falling back to library file for linking.
ld: warning: text-based stub file /System/Library/Frameworks/ApplicationServices.framework/Versions/A/Frameworks/PrintCore.framework/Versions/A/PrintCore.tbd and library file /System/Library/Frameworks/ApplicationServices.framework/Versions/A/Frameworks/PrintCore.framework/Versions/A/PrintCore are out of sync. Falling back to library file for linking.
ld: warning: text-based stub file /System/Library/Frameworks/ApplicationServices.framework/Versions/A/Frameworks/QD.framework/Versions/A/QD.tbd and library file /System/Library/Frameworks/ApplicationServices.framework/Versions/A/Frameworks/QD.framework/Versions/A/QD are out of sync. Falling back to library file for linking.
ld: warning: text-based stub file /System/Library/Frameworks/ApplicationServices.framework/Versions/A/Frameworks/SpeechSynthesis.framework/Versions/A/SpeechSynthesis.tbd and library file /System/Library/Frameworks/ApplicationServices.framework/Versions/A/Frameworks/SpeechSynthesis.framework/Versions/A/SpeechSynthesis are out of sync. Falling back to library file for linking.
ld: warning: text-based stub file /System/Library/PrivateFrameworks/UIFoundation.framework/Versions/A/UIFoundation.tbd and library file /System/Library/PrivateFrameworks/UIFoundation.framework/Versions/A/UIFoundation are out of sync. Falling back to library file for linking.
ld: warning: text-based stub file /System/Library/Frameworks//Foundation.framework/Versions/C/Foundation.tbd and library file /System/Library/Frameworks//Foundation.framework/Versions/C/Foundation are out of sync. Falling back to library file for linking.
ld: warning: text-based stub file /System/Library/Frameworks//CFNetwork.framework/Versions/A/CFNetwork.tbd and library file /System/Library/Frameworks//CFNetwork.framework/Versions/A/CFNetwork are out of sync. Falling back to library file for linking.
ld: warning: text-based stub file /System/Library/Frameworks/CoreServices.framework/Versions/A/Frameworks/FSEvents.framework/Versions/A/FSEvents.tbd and library file /System/Library/Frameworks/CoreServices.framework/Versions/A/Frameworks/FSEvents.framework/Versions/A/FSEvents are out of sync. Falling back to library file for linking.
ld: warning: text-based stub file /System/Library/Frameworks/CoreServices.framework/Versions/A/Frameworks/CarbonCore.framework/Versions/A/CarbonCore.tbd and library file /System/Library/Frameworks/CoreServices.framework/Versions/A/Frameworks/CarbonCore.framework/Versions/A/CarbonCore are out of sync. Falling back to library file for linking.
ld: warning: text-based stub file /System/Library/Frameworks/CoreServices.framework/Versions/A/Frameworks/Metadata.framework/Versions/A/Metadata.tbd and library file /System/Library/Frameworks/CoreServices.framework/Versions/A/Frameworks/Metadata.framework/Versions/A/Metadata are out of sync. Falling back to library file for linking.
ld: warning: text-based stub file /System/Library/Frameworks/CoreServices.framework/Versions/A/Frameworks/OSServices.framework/Versions/A/OSServices.tbd and library file /System/Library/Frameworks/CoreServices.framework/Versions/A/Frameworks/OSServices.framework/Versions/A/OSServices are out of sync. Falling back to library file for linking.
ld: warning: text-based stub file /System/Library/Frameworks/CoreServices.framework/Versions/A/Frameworks/SearchKit.framework/Versions/A/SearchKit.tbd and library file /System/Library/Frameworks/CoreServices.framework/Versions/A/Frameworks/SearchKit.framework/Versions/A/SearchKit are out of sync. Falling back to library file for linking.
ld: warning: text-based stub file /System/Library/Frameworks/CoreServices.framework/Versions/A/Frameworks/AE.framework/Versions/A/AE.tbd and library file /System/Library/Frameworks/CoreServices.framework/Versions/A/Frameworks/AE.framework/Versions/A/AE are out of sync. Falling back to library file for linking.
ld: warning: text-based stub file /System/Library/Frameworks/CoreServices.framework/Versions/A/Frameworks/LaunchServices.framework/Versions/A/LaunchServices.tbd and library file /System/Library/Frameworks/CoreServices.framework/Versions/A/Frameworks/LaunchServices.framework/Versions/A/LaunchServices are out of sync. Falling back to library file for linking.
ld: warning: text-based stub file /System/Library/Frameworks/CoreServices.framework/Versions/A/Frameworks/DictionaryServices.framework/Versions/A/DictionaryServices.tbd and library file /System/Library/Frameworks/CoreServices.framework/Versions/A/Frameworks/DictionaryServices.framework/Versions/A/DictionaryServices are out of sync. Falling back to library file for linking.
ld: warning: text-based stub file /System/Library/Frameworks/CoreServices.framework/Versions/A/Frameworks/SharedFileList.framework/Versions/A/SharedFileList.tbd and library file /System/Library/Frameworks/CoreServices.framework/Versions/A/Frameworks/SharedFileList.framework/Versions/A/SharedFileList are out of sync. Falling back to library file for linking.
ld: warning: object file (../../../libraries/osx/fmt/lib/libfmt.a(format.cc.o)) was built for newer OSX version (10.13) than being linked (10.12)
ld: warning: text-based stub file /System/Library/Frameworks//CoreFoundation.framework/CoreFoundation.tbd and library file /System/Library/Frameworks//CoreFoundation.framework/CoreFoundation are out of sync. Falling back to library file for linking.
Undefined symbols for architecture x86_64:
  "CParamNode::ToUTF8() const", referenced from:
      CCmpUnitMotion::Init(CParamNode const&) in libsimulation2_dbg.a(CCmpUnitMotion.o)
ld: symbol(s) not found for architecture x86_64
clang: error: linker command failed with exit code 1 (use -v to see invocation)
make[1]: *** [../../../binaries/system/pyrogenesis_dbg] Error 1
make: *** [pyrogenesis] Error 2

Link to build: https://jenkins.wildfiregames.com/job/macos-differential/3917/display/redirect

wraitii edited the summary of this revision. (Show Details)Apr 10 2021, 4:42 PM

Successful build - Chance fights ever on the side of the prudent.

Debug: 
Microsoft (R) Build Engine version 15.9.21+g9802d43bc3 for .NET Framework
Copyright (C) Microsoft Corporation. All rights reserved.

    11>e:\jenkins\workspace\vs2015-differential\libraries\source\spidermonkey\include-win32-debug\js\sweepingapi.h(38): warning C4100: 'needs': unreferenced formal parameter (compiling source file ..\..\..\source\simulation2\components\CCmpAIManager.cpp) [E:\Jenkins\workspace\vs2015-differential\build\workspaces\vs2017\simulation2.vcxproj]
    13>e:\jenkins\workspace\vs2015-differential\source\ps\cstrintern.cpp(104): warning C4100: 'context': unreferenced formal parameter [E:\Jenkins\workspace\vs2015-differential\build\workspaces\vs2017\engine.vcxproj]
    13>e:\jenkins\workspace\vs2015-differential\source\ps\cstrintern.cpp(109): warning C4100: 'context': unreferenced formal parameter [E:\Jenkins\workspace\vs2015-differential\build\workspaces\vs2017\engine.vcxproj]
    13>e:\jenkins\workspace\vs2015-differential\source\ps\cstrintern.cpp(114): warning C4100: 'context': unreferenced formal parameter [E:\Jenkins\workspace\vs2015-differential\build\workspaces\vs2017\engine.vcxproj]
    11>e:\jenkins\workspace\vs2015-differential\libraries\source\spidermonkey\include-win32-debug\js\sweepingapi.h(38): warning C4100: 'needs': unreferenced formal parameter (compiling source file ..\..\..\source\simulation2\serialization\BinarySerializer.cpp) [E:\Jenkins\workspace\vs2015-differential\build\workspaces\vs2017\simulation2.vcxproj]
    11>e:\jenkins\workspace\vs2015-differential\libraries\source\spidermonkey\include-win32-debug\js\sweepingapi.h(38): warning C4100: 'needs': unreferenced formal parameter (compiling source file ..\..\..\source\simulation2\serialization\HashSerializer.cpp) [E:\Jenkins\workspace\vs2015-differential\build\workspaces\vs2017\simulation2.vcxproj]
    11>e:\jenkins\workspace\vs2015-differential\libraries\source\spidermonkey\include-win32-debug\js\sweepingapi.h(38): warning C4100: 'needs': unreferenced formal parameter (compiling source file ..\..\..\source\simulation2\serialization\StdSerializer.cpp) [E:\Jenkins\workspace\vs2015-differential\build\workspaces\vs2017\simulation2.vcxproj]
    11>e:\jenkins\workspace\vs2015-differential\libraries\source\spidermonkey\include-win32-debug\js\sweepingapi.h(38): warning C4100: 'needs': unreferenced formal parameter (compiling source file ..\..\..\source\simulation2\serialization\StdDeserializer.cpp) [E:\Jenkins\workspace\vs2015-differential\build\workspaces\vs2017\simulation2.vcxproj]
    11>e:\jenkins\workspace\vs2015-differential\libraries\source\spidermonkey\include-win32-debug\js\sweepingapi.h(38): warning C4100: 'needs': unreferenced formal parameter (compiling source file ..\..\..\source\simulation2\system\ComponentManagerSerialization.cpp) [E:\Jenkins\workspace\vs2015-differential\build\workspaces\vs2017\simulation2.vcxproj]
    11>e:\jenkins\workspace\vs2015-differential\source\simulation2\system\paramnode.cpp(334): warning C4457: declaration of 'name' hides function parameter [E:\Jenkins\workspace\vs2015-differential\build\workspaces\vs2017\simulation2.vcxproj]
     4>MSVCRTD.lib(initializers.obj) : warning LNK4098: defaultlib 'msvcrt.lib' conflicts with use of other libs; use /NODEFAULTLIB:library [E:\Jenkins\workspace\vs2015-differential\build\workspaces\vs2017\pyrogenesis.vcxproj]
    22>e:\jenkins\workspace\vs2015-differential\libraries\source\spidermonkey\include-win32-debug\js\sweepingapi.h(38): warning C4100: 'needs': unreferenced formal parameter [E:\Jenkins\workspace\vs2015-differential\build\workspaces\vs2017\test.vcxproj]
    22>MSVCRTD.lib(initializers.obj) : warning LNK4098: defaultlib 'msvcrt.lib' conflicts with use of other libs; use /NODEFAULTLIB:library [E:\Jenkins\workspace\vs2015-differential\build\workspaces\vs2017\test.vcxproj]
Release: 
Microsoft (R) Build Engine version 15.9.21+g9802d43bc3 for .NET Framework
Copyright (C) Microsoft Corporation. All rights reserved.

    13>e:\jenkins\workspace\vs2015-differential\source\ps\cstrintern.cpp(104): warning C4100: 'context': unreferenced formal parameter [E:\Jenkins\workspace\vs2015-differential\build\workspaces\vs2017\engine.vcxproj]
    13>e:\jenkins\workspace\vs2015-differential\source\ps\cstrintern.cpp(109): warning C4100: 'context': unreferenced formal parameter [E:\Jenkins\workspace\vs2015-differential\build\workspaces\vs2017\engine.vcxproj]
    13>e:\jenkins\workspace\vs2015-differential\source\ps\cstrintern.cpp(114): warning C4100: 'context': unreferenced formal parameter [E:\Jenkins\workspace\vs2015-differential\build\workspaces\vs2017\engine.vcxproj]
    11>e:\jenkins\workspace\vs2015-differential\source\simulation2\system\paramnode.cpp(334): warning C4457: declaration of 'name' hides function parameter [E:\Jenkins\workspace\vs2015-differential\build\workspaces\vs2017\simulation2.vcxproj]
    22>e:\jenkins\workspace\vs2015-differential\source\maths\fixed.h(158): warning C4724: potential mod by 0 [E:\Jenkins\workspace\vs2015-differential\build\workspaces\vs2017\test.vcxproj]

Link to build: https://jenkins.wildfiregames.com/job/vs2015-differential/5010/display/redirect

wraitii added inline comments.Apr 10 2021, 4:50 PM
source/gui/Scripting/JSInterface_GUIManager.cpp
77–89

These are 'debug' functions, though this also makes it possible for JS to read XML files, in effect, & I might add those next to related JSON functions.
(this opens up the door for an actor/template editor in-game)

source/simulation2/scripting/ScriptComponent.h
99–129 ↗(On Diff #17024)

This seemed to make sense and not loading Component.h is nice.

source/simulation2/system/ParamNode.h
285–286

TODO: encapsulate these two better, possibly just by making them const.

Successful build - Chance fights ever on the side of the prudent.

builderr-debug-gcc7.txt
../../../source/ps/CStrIntern.cpp: In constructor 'CStrIntern::CStrIntern(CStrInternContext&)':
../../../source/ps/CStrIntern.cpp:104:43: warning: unused parameter 'context' [-Wunused-parameter]
 CStrIntern::CStrIntern(CStrInternContext& context)
                        ~~~~~~~~~~~~~~~~~~~^~~~~~~
../../../source/ps/CStrIntern.cpp: In constructor 'CStrIntern::CStrIntern(const char*, CStrInternContext&)':
../../../source/ps/CStrIntern.cpp:109:60: warning: unused parameter 'context' [-Wunused-parameter]
 CStrIntern::CStrIntern(const char* str, CStrInternContext& context)
                                         ~~~~~~~~~~~~~~~~~~~^~~~~~~
../../../source/ps/CStrIntern.cpp: In constructor 'CStrIntern::CStrIntern(const string&, CStrInternContext&)':
../../../source/ps/CStrIntern.cpp:114:67: warning: unused parameter 'context' [-Wunused-parameter]
 CStrIntern::CStrIntern(const std::string& str, CStrInternContext& context)
                                                ~~~~~~~~~~~~~~~~~~~^~~~~~~
builderr-release-gcc7.txt
../../../source/ps/CStrIntern.cpp: In constructor 'CStrIntern::CStrIntern(CStrInternContext&)':
../../../source/ps/CStrIntern.cpp:104:43: warning: unused parameter 'context' [-Wunused-parameter]
 CStrIntern::CStrIntern(CStrInternContext& context)
                        ~~~~~~~~~~~~~~~~~~~^~~~~~~
../../../source/ps/CStrIntern.cpp: In constructor 'CStrIntern::CStrIntern(const char*, CStrInternContext&)':
../../../source/ps/CStrIntern.cpp:109:60: warning: unused parameter 'context' [-Wunused-parameter]
 CStrIntern::CStrIntern(const char* str, CStrInternContext& context)
                                         ~~~~~~~~~~~~~~~~~~~^~~~~~~
../../../source/ps/CStrIntern.cpp: In constructor 'CStrIntern::CStrIntern(const string&, CStrInternContext&)':
../../../source/ps/CStrIntern.cpp:114:67: warning: unused parameter 'context' [-Wunused-parameter]
 CStrIntern::CStrIntern(const std::string& str, CStrInternContext& context)
                                                ~~~~~~~~~~~~~~~~~~~^~~~~~~
In file included from ../../../source/pch/atlas/precompiled.h:26:
../../../source/tools/atlas/GameInterface/Messages.h: In function 'void AtlasMessage::fGetTerrainGroupPreviews(AtlasMessage::qGetTerrainGroupPreviews*)':
../../../source/tools/atlas/GameInterface/Messages.h:315:8: warning: '#'target_mem_ref' not supported by dump_expr#<expression error>' may be used uninitialized in this function [-Wmaybe-uninitialized]
 struct sTerrainTexturePreview
        ^~~~~~~~~~~~~~~~~~~~~~
../../../source/tools/atlas/GameInterface/Messages.h:315:8: warning: '#'target_mem_ref' not supported by dump_expr#<expression error>' may be used uninitialized in this function [-Wmaybe-uninitialized]
../../../source/tools/atlas/GameInterface/Messages.h:315:8: warning: '#'target_mem_ref' not supported by dump_expr#<expression error>' may be used uninitialized in this function [-Wmaybe-uninitialized]
../../../source/tools/atlas/GameInterface/Messages.h:315:8: warning: '#'target_mem_ref' not supported by dump_expr#<expression error>' may be used uninitialized in this function [-Wmaybe-uninitialized]
 struct sTerrainTexturePreview
        ^~~~~~~~~~~~~~~~~~~~~~
../../../source/tools/atlas/GameInterface/Messages.h:315:8: warning: '#'target_mem_ref' not supported by dump_expr#<expression error>' may be used uninitialized in this function [-Wmaybe-uninitialized]
../../../source/tools/atlas/GameInterface/Messages.h:315:8: warning: '#'target_mem_ref' not supported by dump_expr#<expression error>' may be used uninitialized in this function [-Wmaybe-uninitialized]

Link to build: https://jenkins.wildfiregames.com/job/docker-differential/5627/display/redirect

wraitii requested review of this revision.Apr 10 2021, 5:19 PM

Compile, test.

rP25227 + D3830, works for me. Have not noticed any negative side effects so far.

Stan added a subscriber: Stan.Apr 10 2021, 6:42 PM
Stan added inline comments.
source/gui/Scripting/JSInterface_GUIManager.cpp
77–89

Not sure how well that will work with packaged versions of the game... It might introduce some confusion too ?

wraitii edited the summary of this revision. (Show Details)Apr 11 2021, 8:42 AM
wraitii updated this revision to Diff 17031.Apr 11 2021, 11:25 AM

Rebase & cleanup.

This fixes a few interface woes & cleans code up.

I think the JS & XML ApplyLayer could be merged with some clever templating & a few other changes but i'll do that later.

Also TODO later -> update HandleTokens to not copy strings like a crazy madman.

Might need a tad more tweaking but I'm removing [WIP]

wraitii retitled this revision from [WIP] ParamNode extension to ParamNode extension.Apr 11 2021, 11:28 AM
wraitii edited the summary of this revision. (Show Details)
wraitii added inline comments.
source/gui/Scripting/JSInterface_GUIManager.cpp
77–89

Makes no difference. Not sure what you mean about confusion.

Build failure - The Moirai have given mortals hearts that can endure.

Debug: 
Microsoft (R) Build Engine version 15.9.21+g9802d43bc3 for .NET Framework
Copyright (C) Microsoft Corporation. All rights reserved.

    11>e:\jenkins\workspace\vs2015-differential\libraries\source\spidermonkey\include-win32-debug\js\sweepingapi.h(38): warning C4100: 'needs': unreferenced formal parameter (compiling source file ..\..\..\source\simulation2\components\CCmpAIManager.cpp) [E:\Jenkins\workspace\vs2015-differential\build\workspaces\vs2017\simulation2.vcxproj]
    11>e:\jenkins\workspace\vs2015-differential\libraries\source\spidermonkey\include-win32-debug\js\sweepingapi.h(38): warning C4100: 'needs': unreferenced formal parameter (compiling source file ..\..\..\source\simulation2\serialization\BinarySerializer.cpp) [E:\Jenkins\workspace\vs2015-differential\build\workspaces\vs2017\simulation2.vcxproj]
    11>e:\jenkins\workspace\vs2015-differential\libraries\source\spidermonkey\include-win32-debug\js\sweepingapi.h(38): warning C4100: 'needs': unreferenced formal parameter (compiling source file ..\..\..\source\simulation2\serialization\HashSerializer.cpp) [E:\Jenkins\workspace\vs2015-differential\build\workspaces\vs2017\simulation2.vcxproj]
    11>e:\jenkins\workspace\vs2015-differential\libraries\source\spidermonkey\include-win32-debug\js\sweepingapi.h(38): warning C4100: 'needs': unreferenced formal parameter (compiling source file ..\..\..\source\simulation2\serialization\StdDeserializer.cpp) [E:\Jenkins\workspace\vs2015-differential\build\workspaces\vs2017\simulation2.vcxproj]
    11>e:\jenkins\workspace\vs2015-differential\libraries\source\spidermonkey\include-win32-debug\js\sweepingapi.h(38): warning C4100: 'needs': unreferenced formal parameter (compiling source file ..\..\..\source\simulation2\serialization\StdSerializer.cpp) [E:\Jenkins\workspace\vs2015-differential\build\workspaces\vs2017\simulation2.vcxproj]
    11>e:\jenkins\workspace\vs2015-differential\libraries\source\spidermonkey\include-win32-debug\js\sweepingapi.h(38): warning C4100: 'needs': unreferenced formal parameter (compiling source file ..\..\..\source\simulation2\system\ComponentManagerSerialization.cpp) [E:\Jenkins\workspace\vs2015-differential\build\workspaces\vs2017\simulation2.vcxproj]
     4>MSVCRTD.lib(initializers.obj) : warning LNK4098: defaultlib 'msvcrt.lib' conflicts with use of other libs; use /NODEFAULTLIB:library [E:\Jenkins\workspace\vs2015-differential\build\workspaces\vs2017\pyrogenesis.vcxproj]
    22>e:\jenkins\workspace\vs2015-differential\libraries\source\spidermonkey\include-win32-debug\js\sweepingapi.h(38): warning C4100: 'needs': unreferenced formal parameter [E:\Jenkins\workspace\vs2015-differential\build\workspaces\vs2017\test.vcxproj]
    22>e:\jenkins\workspace\vs2015-differential\source\simulation2\tests\test_paramnode.h(93): error C2660: 'CParamNode::LoadJS': function does not take 4 arguments (compiling source file ..\..\..\source\simulation2\tests\test_ParamNode.cpp) [E:\Jenkins\workspace\vs2015-differential\build\workspaces\vs2017\test.vcxproj]

Link to build: https://jenkins.wildfiregames.com/job/vs2015-differential/5015/display/redirect

Build failure - The Moirai have given mortals hearts that can endure.

builderr-debug-macos.txt
/Applications/Xcode.app/Contents/Developer/Toolchains/XcodeDefault.xctoolchain/usr/bin/ranlib: file: ../../../binaries/system/liblobby_dbg.a(precompiled.o) has no symbols
/Applications/Xcode.app/Contents/Developer/Toolchains/XcodeDefault.xctoolchain/usr/bin/ranlib: file: ../../../binaries/system/libsimulation2_dbg.a(precompiled.o) has no symbols
/Applications/Xcode.app/Contents/Developer/Toolchains/XcodeDefault.xctoolchain/usr/bin/ranlib: file: ../../../binaries/system/libengine_dbg.a(precompiled.o) has no symbols
../../../source/graphics/ShaderProgram.cpp:86:15: warning: 'Reload' overrides a member function but is not marked 'override' [-Winconsistent-missing-override]
        virtual void Reload()
                     ^
../../../source/graphics/ShaderProgram.h:124:15: note: overridden virtual function is here
        virtual void Reload() = 0;
                     ^
../../../source/graphics/ShaderProgram.cpp:118:15: warning: 'Bind' overrides a member function but is not marked 'override' [-Winconsistent-missing-override]
        virtual void Bind()
                     ^
../../../source/graphics/ShaderProgram.h:135:15: note: overridden virtual function is here
        virtual void Bind() = 0;
                     ^
../../../source/graphics/ShaderProgram.cpp:128:15: warning: 'Unbind' overrides a member function but is not marked 'override' [-Winconsistent-missing-override]
        virtual void Unbind()
                     ^
../../../source/graphics/ShaderProgram.h:140:15: note: overridden virtual function is here
        virtual void Unbind() = 0;
                     ^
../../../source/graphics/ShaderProgram.cpp:156:18: warning: 'GetTextureBinding' overrides a member function but is not marked 'override' [-Winconsistent-missing-override]
        virtual Binding GetTextureBinding(texture_id_t id)
                        ^
../../../source/graphics/ShaderProgram.h:149:18: note: overridden virtual function is here
        virtual Binding GetTextureBinding(texture_id_t id) = 0;
                        ^
../../../source/graphics/ShaderProgram.cpp:166:15: warning: 'BindTexture' overrides a member function but is not marked 'override' [-Winconsistent-missing-override]
        virtual void BindTexture(texture_id_t id, Handle tex)
                     ^
../../../source/graphics/ShaderProgram.h:153:15: note: overridden virtual function is here
        virtual void BindTexture(texture_id_t id, Handle tex) = 0;
                     ^
../../../source/graphics/ShaderProgram.cpp:179:15: warning: 'BindTexture' overrides a member function but is not marked 'override' [-Winconsistent-missing-override]
        virtual void BindTexture(texture_id_t id, GLuint tex)
                     ^
../../../source/graphics/ShaderProgram.h:154:15: note: overridden virtual function is here
        virtual void BindTexture(texture_id_t id, GLuint tex) = 0;
                     ^
../../../source/graphics/ShaderProgram.cpp:190:15: warning: 'BindTexture' overrides a member function but is not marked 'override' [-Winconsistent-missing-override]
        virtual void BindTexture(Binding id, Handle tex)
                     ^
../../../source/graphics/ShaderProgram.h:155:15: note: overridden virtual function is here
        virtual void BindTexture(Binding id, Handle tex) = 0;
                     ^
../../../source/graphics/ShaderProgram.cpp:197:18: warning: 'GetUniformBinding' overrides a member function but is not marked 'override' [-Winconsistent-missing-override]
        virtual Binding GetUniformBinding(uniform_id_t id)
                        ^
../../../source/graphics/ShaderProgram.h:158:18: note: overridden virtual function is here
        virtual Binding GetUniformBinding(uniform_id_t id) = 0;
                        ^
../../../source/graphics/ShaderProgram.cpp:202:15: warning: 'Uniform' overrides a member function but is not marked 'override' [-Winconsistent-missing-override]
        virtual void Uniform(Binding id, float v0, float v1, float v2, float v3)
                     ^
../../../source/graphics/ShaderProgram.h:161:15: note: overridden virtual function is here
        virtual void Uniform(Binding id, float v0, float v1, float v2, float v3) = 0;
                     ^
../../../source/graphics/ShaderProgram.cpp:211:15: warning: 'Uniform' overrides a member function but is not marked 'override' [-Winconsistent-missing-override]
        virtual void Uniform(Binding id, const CMatrix3D& v)
                     ^
../../../source/graphics/ShaderProgram.h:162:15: note: overridden virtual function is here
        virtual void Uniform(Binding id, const CMatrix3D& v) = 0;
                     ^
../../../source/graphics/ShaderProgram.cpp:230:15: warning: 'Uniform' overrides a member function but is not marked 'override' [-Winconsistent-missing-override]
        virtual void Uniform(Binding id, size_t count, const CMatrix3D* v)
                     ^
../../../source/graphics/ShaderProgram.h:163:15: note: overridden virtual function is here
        virtual void Uniform(Binding id, size_t count, const CMatrix3D* v) = 0;
                     ^
../../../source/graphics/ShaderProgram.cpp:236:15: warning: 'Uniform' overrides a member function but is not marked 'override' [-Winconsistent-missing-override]
        virtual void Uniform(Binding id, size_t count, const float* v)
                     ^
../../../source/graphics/ShaderProgram.h:164:15: note: overridden virtual function is here
        virtual void Uniform(Binding id, size_t count, const float* v) = 0;
                     ^
12 warnings generated.
/Applications/Xcode.app/Contents/Developer/Toolchains/XcodeDefault.xctoolchain/usr/bin/ranlib: file: ../../../binaries/system/libgraphics_dbg.a(precompiled.o) has no symbols
/Applications/Xcode.app/Contents/Developer/Toolchains/XcodeDefault.xctoolchain/usr/bin/ranlib: file: ../../../binaries/system/libatlas_dbg.a(precompiled.o) has no symbols
/Applications/Xcode.app/Contents/Developer/Toolchains/XcodeDefault.xctoolchain/usr/bin/ranlib: file: ../../../binaries/system/libgui_dbg.a(precompiled.o) has no symbols
ld: warning: text-based stub file /System/Library/Frameworks//CoreAudio.framework/CoreAudio.tbd and library file /System/Library/Frameworks//CoreAudio.framework/CoreAudio are out of sync. Falling back to library file for linking.
ld: warning: text-based stub file /System/Library/Frameworks//AudioToolbox.framework/AudioToolbox.tbd and library file /System/Library/Frameworks//AudioToolbox.framework/AudioToolbox are out of sync. Falling back to library file for linking.
ld: warning: text-based stub file /System/Library/Frameworks//ForceFeedback.framework/ForceFeedback.tbd and library file /System/Library/Frameworks//ForceFeedback.framework/ForceFeedback are out of sync. Falling back to library file for linking.
ld: warning: text-based stub file /System/Library/Frameworks//CoreVideo.framework/CoreVideo.tbd and library file /System/Library/Frameworks//CoreVideo.framework/CoreVideo are out of sync. Falling back to library file for linking.
ld: warning: text-based stub file /System/Library/Frameworks//Cocoa.framework/Cocoa.tbd and library file /System/Library/Frameworks//Cocoa.framework/Cocoa are out of sync. Falling back to library file for linking.
ld: warning: text-based stub file /System/Library/Frameworks//IOKit.framework/IOKit.tbd and library file /System/Library/Frameworks//IOKit.framework/IOKit are out of sync. Falling back to library file for linking.
ld: warning: text-based stub file /System/Library/Frameworks//QuartzCore.framework/QuartzCore.tbd and library file /System/Library/Frameworks//QuartzCore.framework/QuartzCore are out of sync. Falling back to library file for linking.
ld: warning: text-based stub file /System/Library/Frameworks//Metal.framework/Metal.tbd and library file /System/Library/Frameworks//Metal.framework/Metal are out of sync. Falling back to library file for linking.
ld: warning: text-based stub file /System/Library/Frameworks//OpenGL.framework/OpenGL.tbd and library file /System/Library/Frameworks//OpenGL.framework/OpenGL are out of sync. Falling back to library file for linking.
ld: warning: text-based stub file /System/Library/Frameworks//Security.framework/Security.tbd and library file /System/Library/Frameworks//Security.framework/Security are out of sync. Falling back to library file for linking.
ld: warning: text-based stub file /System/Library/Frameworks//OpenAL.framework/OpenAL.tbd and library file /System/Library/Frameworks//OpenAL.framework/OpenAL are out of sync. Falling back to library file for linking.
ld: warning: text-based stub file /System/Library/Frameworks//ApplicationServices.framework/ApplicationServices.tbd and library file /System/Library/Frameworks//ApplicationServices.framework/ApplicationServices are out of sync. Falling back to library file for linking.
ld: warning: text-based stub file /System/Library/Frameworks//Cocoa.framework/Cocoa.tbd and library file /System/Library/Frameworks//Cocoa.framework/Cocoa are out of sync. Falling back to library file for linking.
ld: warning: text-based stub file /System/Library/Frameworks//CoreFoundation.framework/CoreFoundation.tbd and library file /System/Library/Frameworks//CoreFoundation.framework/CoreFoundation are out of sync. Falling back to library file for linking.
ld: warning: text-based stub file /System/Library/Frameworks//CoreImage.framework/Versions/A/CoreImage.tbd and library file /System/Library/Frameworks//CoreImage.framework/Versions/A/CoreImage are out of sync. Falling back to library file for linking.
ld: warning: text-based stub file /System/Library/Frameworks//AppKit.framework/Versions/C/AppKit.tbd and library file /System/Library/Frameworks//AppKit.framework/Versions/C/AppKit are out of sync. Falling back to library file for linking.
ld: warning: text-based stub file /System/Library/Frameworks//CoreData.framework/Versions/A/CoreData.tbd and library file /System/Library/Frameworks//CoreData.framework/Versions/A/CoreData are out of sync. Falling back to library file for linking.
ld: warning: text-based stub file /System/Library/Frameworks/Carbon.framework/Versions/A/Frameworks/CommonPanels.framework/Versions/A/CommonPanels.tbd and library file /System/Library/Frameworks/Carbon.framework/Versions/A/Frameworks/CommonPanels.framework/Versions/A/CommonPanels are out of sync. Falling back to library file for linking.
ld: warning: text-based stub file /System/Library/Frameworks/Carbon.framework/Versions/A/Frameworks/HIToolbox.framework/Versions/A/HIToolbox.tbd and library file /System/Library/Frameworks/Carbon.framework/Versions/A/Frameworks/HIToolbox.framework/Versions/A/HIToolbox are out of sync. Falling back to library file for linking.
ld: warning: text-based stub file /System/Library/Frameworks/Carbon.framework/Versions/A/Frameworks/Help.framework/Versions/A/Help.tbd and library file /System/Library/Frameworks/Carbon.framework/Versions/A/Frameworks/Help.framework/Versions/A/Help are out of sync. Falling back to library file for linking.
ld: warning: text-based stub file /System/Library/Frameworks/Carbon.framework/Versions/A/Frameworks/ImageCapture.framework/Versions/A/ImageCapture.tbd and library file /System/Library/Frameworks/Carbon.framework/Versions/A/Frameworks/ImageCapture.framework/Versions/A/ImageCapture are out of sync. Falling back to library file for linking.
ld: warning: text-based stub file /System/Library/Frameworks/Carbon.framework/Versions/A/Frameworks/Ink.framework/Versions/A/Ink.tbd and library file /System/Library/Frameworks/Carbon.framework/Versions/A/Frameworks/Ink.framework/Versions/A/Ink are out of sync. Falling back to library file for linking.
ld: warning: text-based stub file /System/Library/Frameworks/Carbon.framework/Versions/A/Frameworks/OpenScripting.framework/Versions/A/OpenScripting.tbd and library file /System/Library/Frameworks/Carbon.framework/Versions/A/Frameworks/OpenScripting.framework/Versions/A/OpenScripting are out of sync. Falling back to library file for linking.
ld: warning: text-based stub file /System/Library/Frameworks/Carbon.framework/Versions/A/Frameworks/Print.framework/Versions/A/Print.tbd and library file /System/Library/Frameworks/Carbon.framework/Versions/A/Frameworks/Print.framework/Versions/A/Print are out of sync. Falling back to library file for linking.
ld: warning: text-based stub file /System/Library/Frameworks/Carbon.framework/Versions/A/Frameworks/SecurityHI.framework/Versions/A/SecurityHI.tbd and library file /System/Library/Frameworks/Carbon.framework/Versions/A/Frameworks/SecurityHI.framework/Versions/A/SecurityHI are out of sync. Falling back to library file for linking.
ld: warning: text-based stub file /System/Library/Frameworks/Carbon.framework/Versions/A/Frameworks/SpeechRecognition.framework/Versions/A/SpeechRecognition.tbd and library file /System/Library/Frameworks/Carbon.framework/Versions/A/Frameworks/SpeechRecognition.framework/Versions/A/SpeechRecognition are out of sync. Falling back to library file for linking.
ld: warning: text-based stub file /System/Library/Frameworks/OpenGL.framework/Versions/A/Libraries/libGLU.tbd and library file /System/Library/Frameworks/OpenGL.framework/Versions/A/Libraries/libGLU.dylib are out of sync. Falling back to library file for linking.
ld: warning: text-based stub file /System/Library/Frameworks/OpenGL.framework/Versions/A/Libraries/libGL.tbd and library file /System/Library/Frameworks/OpenGL.framework/Versions/A/Libraries/libGL.dylib are out of sync. Falling back to library file for linking.
ld: warning: text-based stub file /System/Library/Frameworks//CoreGraphics.framework/Versions/A/CoreGraphics.tbd and library file /System/Library/Frameworks//CoreGraphics.framework/Versions/A/CoreGraphics are out of sync. Falling back to library file for linking.
ld: warning: text-based stub file /System/Library/Frameworks//CoreText.framework/Versions/A/CoreText.tbd and library file /System/Library/Frameworks//CoreText.framework/Versions/A/CoreText are out of sync. Falling back to library file for linking.
ld: warning: text-based stub file /System/Library/Frameworks//ImageIO.framework/Versions/A/ImageIO.tbd and library file /System/Library/Frameworks//ImageIO.framework/Versions/A/ImageIO are out of sync. Falling back to library file for linking.
ld: warning: text-based stub file /System/Library/Frameworks//ColorSync.framework/Versions/A/ColorSync.tbd and library file /System/Library/Frameworks//ColorSync.framework/Versions/A/ColorSync are out of sync. Falling back to library file for linking.
ld: warning: text-based stub file /System/Library/Frameworks/ApplicationServices.framework/Versions/A/Frameworks/ATS.framework/Versions/A/ATS.tbd and library file /System/Library/Frameworks/ApplicationServices.framework/Versions/A/Frameworks/ATS.framework/Versions/A/ATS are out of sync. Falling back to library file for linking.
ld: warning: text-based stub file /System/Library/Frameworks/ApplicationServices.framework/Versions/A/Frameworks/ColorSyncLegacy.framework/Versions/A/ColorSyncLegacy.tbd and library file /System/Library/Frameworks/ApplicationServices.framework/Versions/A/Frameworks/ColorSyncLegacy.framework/Versions/A/ColorSyncLegacy are out of sync. Falling back to library file for linking.
ld: warning: text-based stub file /System/Library/Frameworks//CoreServices.framework/Versions/A/CoreServices.tbd and library file /System/Library/Frameworks//CoreServices.framework/Versions/A/CoreServices are out of sync. Falling back to library file for linking.
ld: warning: text-based stub file /System/Library/Frameworks/ApplicationServices.framework/Versions/A/Frameworks/HIServices.framework/Versions/A/HIServices.tbd and library file /System/Library/Frameworks/ApplicationServices.framework/Versions/A/Frameworks/HIServices.framework/Versions/A/HIServices are out of sync. Falling back to library file for linking.
ld: warning: text-based stub file /System/Library/Frameworks/ApplicationServices.framework/Versions/A/Frameworks/LangAnalysis.framework/Versions/A/LangAnalysis.tbd and library file /System/Library/Frameworks/ApplicationServices.framework/Versions/A/Frameworks/LangAnalysis.framework/Versions/A/LangAnalysis are out of sync. Falling back to library file for linking.
ld: warning: text-based stub file /System/Library/Frameworks/ApplicationServices.framework/Versions/A/Frameworks/PrintCore.framework/Versions/A/PrintCore.tbd and library file /System/Library/Frameworks/ApplicationServices.framework/Versions/A/Frameworks/PrintCore.framework/Versions/A/PrintCore are out of sync. Falling back to library file for linking.
ld: warning: text-based stub file /System/Library/Frameworks/ApplicationServices.framework/Versions/A/Frameworks/QD.framework/Versions/A/QD.tbd and library file /System/Library/Frameworks/ApplicationServices.framework/Versions/A/Frameworks/QD.framework/Versions/A/QD are out of sync. Falling back to library file for linking.
ld: warning: text-based stub file /System/Library/Frameworks/ApplicationServices.framework/Versions/A/Frameworks/SpeechSynthesis.framework/Versions/A/SpeechSynthesis.tbd and library file /System/Library/Frameworks/ApplicationServices.framework/Versions/A/Frameworks/SpeechSynthesis.framework/Versions/A/SpeechSynthesis are out of sync. Falling back to library file for linking.
ld: warning: text-based stub file /System/Library/PrivateFrameworks/UIFoundation.framework/Versions/A/UIFoundation.tbd and library file /System/Library/PrivateFrameworks/UIFoundation.framework/Versions/A/UIFoundation are out of sync. Falling back to library file for linking.
ld: warning: text-based stub file /System/Library/Frameworks//Foundation.framework/Versions/C/Foundation.tbd and library file /System/Library/Frameworks//Foundation.framework/Versions/C/Foundation are out of sync. Falling back to library file for linking.
ld: warning: text-based stub file /System/Library/Frameworks//CFNetwork.framework/Versions/A/CFNetwork.tbd and library file /System/Library/Frameworks//CFNetwork.framework/Versions/A/CFNetwork are out of sync. Falling back to library file for linking.
ld: warning: text-based stub file /System/Library/Frameworks/CoreServices.framework/Versions/A/Frameworks/FSEvents.framework/Versions/A/FSEvents.tbd and library file /System/Library/Frameworks/CoreServices.framework/Versions/A/Frameworks/FSEvents.framework/Versions/A/FSEvents are out of sync. Falling back to library file for linking.
ld: warning: text-based stub file /System/Library/Frameworks/CoreServices.framework/Versions/A/Frameworks/CarbonCore.framework/Versions/A/CarbonCore.tbd and library file /System/Library/Frameworks/CoreServices.framework/Versions/A/Frameworks/CarbonCore.framework/Versions/A/CarbonCore are out of sync. Falling back to library file for linking.
ld: warning: text-based stub file /System/Library/Frameworks/CoreServices.framework/Versions/A/Frameworks/Metadata.framework/Versions/A/Metadata.tbd and library file /System/Library/Frameworks/CoreServices.framework/Versions/A/Frameworks/Metadata.framework/Versions/A/Metadata are out of sync. Falling back to library file for linking.
ld: warning: text-based stub file /System/Library/Frameworks/CoreServices.framework/Versions/A/Frameworks/OSServices.framework/Versions/A/OSServices.tbd and library file /System/Library/Frameworks/CoreServices.framework/Versions/A/Frameworks/OSServices.framework/Versions/A/OSServices are out of sync. Falling back to library file for linking.
ld: warning: text-based stub file /System/Library/Frameworks/CoreServices.framework/Versions/A/Frameworks/SearchKit.framework/Versions/A/SearchKit.tbd and library file /System/Library/Frameworks/CoreServices.framework/Versions/A/Frameworks/SearchKit.framework/Versions/A/SearchKit are out of sync. Falling back to library file for linking.
ld: warning: text-based stub file /System/Library/Frameworks/CoreServices.framework/Versions/A/Frameworks/AE.framework/Versions/A/AE.tbd and library file /System/Library/Frameworks/CoreServices.framework/Versions/A/Frameworks/AE.framework/Versions/A/AE are out of sync. Falling back to library file for linking.
ld: warning: text-based stub file /System/Library/Frameworks/CoreServices.framework/Versions/A/Frameworks/LaunchServices.framework/Versions/A/LaunchServices.tbd and library file /System/Library/Frameworks/CoreServices.framework/Versions/A/Frameworks/LaunchServices.framework/Versions/A/LaunchServices are out of sync. Falling back to library file for linking.
ld: warning: text-based stub file /System/Library/Frameworks/CoreServices.framework/Versions/A/Frameworks/DictionaryServices.framework/Versions/A/DictionaryServices.tbd and library file /System/Library/Frameworks/CoreServices.framework/Versions/A/Frameworks/DictionaryServices.framework/Versions/A/DictionaryServices are out of sync. Falling back to library file for linking.
ld: warning: text-based stub file /System/Library/Frameworks/CoreServices.framework/Versions/A/Frameworks/SharedFileList.framework/Versions/A/SharedFileList.tbd and library file /System/Library/Frameworks/CoreServices.framework/Versions/A/Frameworks/SharedFileList.framework/Versions/A/SharedFileList are out of sync. Falling back to library file for linking.
ld: warning: object file (../../../libraries/osx/fmt/lib/libfmt.a(format.cc.o)) was built for newer OSX version (10.13) than being linked (10.12)
ld: warning: text-based stub file /System/Library/Frameworks//CoreFoundation.framework/CoreFoundation.tbd and library file /System/Library/Frameworks//CoreFoundation.framework/CoreFoundation are out of sync. Falling back to library file for linking.
Undefined symbols for architecture x86_64:
  "CParamNode::ToUTF8() const", referenced from:
      CCmpUnitMotion::Init(CParamNode const&) in libsimulation2_dbg.a(CCmpUnitMotion.o)
ld: symbol(s) not found for architecture x86_64
clang: error: linker command failed with exit code 1 (use -v to see invocation)
make[1]: *** [../../../binaries/system/pyrogenesis_dbg] Error 1
make: *** [pyrogenesis] Error 2

Link to build: https://jenkins.wildfiregames.com/job/macos-differential/3922/display/redirect

Build failure - The Moirai have given mortals hearts that can endure.

builderr-debug-macos.txt
/Applications/Xcode.app/Contents/Developer/Toolchains/XcodeDefault.xctoolchain/usr/bin/ranlib: file: ../../../binaries/system/libnetwork_dbg.a(precompiled.o) has no symbols
/Applications/Xcode.app/Contents/Developer/Toolchains/XcodeDefault.xctoolchain/usr/bin/ranlib: file: ../../../binaries/system/libtinygettext_dbg.a(precompiled.o) has no symbols
/Applications/Xcode.app/Contents/Developer/Toolchains/XcodeDefault.xctoolchain/usr/bin/ranlib: file: ../../../binaries/system/libtinygettext_dbg.a(tinygettext.o) has no symbols
/Applications/Xcode.app/Contents/Developer/Toolchains/XcodeDefault.xctoolchain/usr/bin/ranlib: file: ../../../binaries/system/liblobby_dbg.a(precompiled.o) has no symbols
/Applications/Xcode.app/Contents/Developer/Toolchains/XcodeDefault.xctoolchain/usr/bin/ranlib: file: ../../../binaries/system/libglooxwrapper_dbg.a(precompiled.o) has no symbols
/Applications/Xcode.app/Contents/Developer/Toolchains/XcodeDefault.xctoolchain/usr/bin/ranlib: file: ../../../binaries/system/libsimulation2_dbg.a(precompiled.o) has no symbols
/Applications/Xcode.app/Contents/Developer/Toolchains/XcodeDefault.xctoolchain/usr/bin/ranlib: file: ../../../binaries/system/libscriptinterface_dbg.a(precompiled.o) has no symbols
/Applications/Xcode.app/Contents/Developer/Toolchains/XcodeDefault.xctoolchain/usr/bin/ranlib: file: ../../../binaries/system/libengine_dbg.a(precompiled.o) has no symbols
../../../source/graphics/ShaderProgram.cpp:86:15: warning: 'Reload' overrides a member function but is not marked 'override' [-Winconsistent-missing-override]
        virtual void Reload()
                     ^
../../../source/graphics/ShaderProgram.h:124:15: note: overridden virtual function is here
        virtual void Reload() = 0;
                     ^
../../../source/graphics/ShaderProgram.cpp:118:15: warning: 'Bind' overrides a member function but is not marked 'override' [-Winconsistent-missing-override]
        virtual void Bind()
                     ^
../../../source/graphics/ShaderProgram.h:135:15: note: overridden virtual function is here
        virtual void Bind() = 0;
                     ^
../../../source/graphics/ShaderProgram.cpp:128:15: warning: 'Unbind' overrides a member function but is not marked 'override' [-Winconsistent-missing-override]
        virtual void Unbind()
                     ^
../../../source/graphics/ShaderProgram.h:140:15: note: overridden virtual function is here
        virtual void Unbind() = 0;
                     ^
../../../source/graphics/ShaderProgram.cpp:156:18: warning: 'GetTextureBinding' overrides a member function but is not marked 'override' [-Winconsistent-missing-override]
        virtual Binding GetTextureBinding(texture_id_t id)
                        ^
../../../source/graphics/ShaderProgram.h:149:18: note: overridden virtual function is here
        virtual Binding GetTextureBinding(texture_id_t id) = 0;
                        ^
../../../source/graphics/ShaderProgram.cpp:166:15: warning: 'BindTexture' overrides a member function but is not marked 'override' [-Winconsistent-missing-override]
        virtual void BindTexture(texture_id_t id, Handle tex)
                     ^
../../../source/graphics/ShaderProgram.h:153:15: note: overridden virtual function is here
        virtual void BindTexture(texture_id_t id, Handle tex) = 0;
                     ^
../../../source/graphics/ShaderProgram.cpp:179:15: warning: 'BindTexture' overrides a member function but is not marked 'override' [-Winconsistent-missing-override]
        virtual void BindTexture(texture_id_t id, GLuint tex)
                     ^
../../../source/graphics/ShaderProgram.h:154:15: note: overridden virtual function is here
        virtual void BindTexture(texture_id_t id, GLuint tex) = 0;
                     ^
../../../source/graphics/ShaderProgram.cpp:190:15: warning: 'BindTexture' overrides a member function but is not marked 'override' [-Winconsistent-missing-override]
        virtual void BindTexture(Binding id, Handle tex)
                     ^
../../../source/graphics/ShaderProgram.h:155:15: note: overridden virtual function is here
        virtual void BindTexture(Binding id, Handle tex) = 0;
                     ^
../../../source/graphics/ShaderProgram.cpp:197:18: warning: 'GetUniformBinding' overrides a member function but is not marked 'override' [-Winconsistent-missing-override]
        virtual Binding GetUniformBinding(uniform_id_t id)
                        ^
../../../source/graphics/ShaderProgram.h:158:18: note: overridden virtual function is here
        virtual Binding GetUniformBinding(uniform_id_t id) = 0;
                        ^
../../../source/graphics/ShaderProgram.cpp:202:15: warning: 'Uniform' overrides a member function but is not marked 'override' [-Winconsistent-missing-override]
        virtual void Uniform(Binding id, float v0, float v1, float v2, float v3)
                     ^
../../../source/graphics/ShaderProgram.h:161:15: note: overridden virtual function is here
        virtual void Uniform(Binding id, float v0, float v1, float v2, float v3) = 0;
                     ^
../../../source/graphics/ShaderProgram.cpp:211:15: warning: 'Uniform' overrides a member function but is not marked 'override' [-Winconsistent-missing-override]
        virtual void Uniform(Binding id, const CMatrix3D& v)
                     ^
../../../source/graphics/ShaderProgram.h:162:15: note: overridden virtual function is here
        virtual void Uniform(Binding id, const CMatrix3D& v) = 0;
                     ^
../../../source/graphics/ShaderProgram.cpp:230:15: warning: 'Uniform' overrides a member function but is not marked 'override' [-Winconsistent-missing-override]
        virtual void Uniform(Binding id, size_t count, const CMatrix3D* v)
                     ^
../../../source/graphics/ShaderProgram.h:163:15: note: overridden virtual function is here
        virtual void Uniform(Binding id, size_t count, const CMatrix3D* v) = 0;
                     ^
../../../source/graphics/ShaderProgram.cpp:236:15: warning: 'Uniform' overrides a member function but is not marked 'override' [-Winconsistent-missing-override]
        virtual void Uniform(Binding id, size_t count, const float* v)
                     ^
../../../source/graphics/ShaderProgram.h:164:15: note: overridden virtual function is here
        virtual void Uniform(Binding id, size_t count, const float* v) = 0;
                     ^
12 warnings generated.
/Applications/Xcode.app/Contents/Developer/Toolchains/XcodeDefault.xctoolchain/usr/bin/ranlib: file: ../../../binaries/system/libgraphics_dbg.a(precompiled.o) has no symbols
/Applications/Xcode.app/Contents/Developer/Toolchains/XcodeDefault.xctoolchain/usr/bin/ranlib: file: ../../../binaries/system/libatlas_dbg.a(precompiled.o) has no symbols
/Applications/Xcode.app/Contents/Developer/Toolchains/XcodeDefault.xctoolchain/usr/bin/ranlib: file: ../../../binaries/system/libgui_dbg.a(precompiled.o) has no symbols
../../../source/lib/sysdep/arch/amd64/amd64.cpp:70:9: warning: 'OSAtomicAdd64Barrier' is deprecated: first deprecated in macOS 10.12 - Use std::atomic_fetch_add() from <atomic> instead [-Wdeprecated-declarations]
        return OSAtomicAdd64Barrier(increment, (volatile int64_t*)location);
               ^
/usr/include/libkern/OSAtomicDeprecated.h:247:9: note: 'OSAtomicAdd64Barrier' has been explicitly marked deprecated here
int64_t OSAtomicAdd64Barrier( int64_t __theAmount,
        ^
../../../source/lib/sysdep/arch/amd64/amd64.cpp:76:9: warning: 'OSAtomicCompareAndSwapPtrBarrier' is deprecated: first deprecated in macOS 10.12 - Use std::atomic_compare_exchange_strong() from <atomic> instead [-Wdeprecated-declarations]
        return OSAtomicCompareAndSwapPtrBarrier((void*)expected, (void*)newValue, (void* volatile*)location);
               ^
/usr/include/libkern/OSAtomicDeprecated.h:547:6: note: 'OSAtomicCompareAndSwapPtrBarrier' has been explicitly marked deprecated here
bool    OSAtomicCompareAndSwapPtrBarrier( void *__oldValue, void *__newValue, void * volatile *__theValue );
        ^
../../../source/lib/sysdep/arch/amd64/amd64.cpp:81:9: warning: 'OSAtomicCompareAndSwap64Barrier' is deprecated: first deprecated in macOS 10.12 - Use std::atomic_compare_exchange_strong() from <atomic> instead [-Wdeprecated-declarations]
        return OSAtomicCompareAndSwap64Barrier(expected, newValue, location);
               ^
/usr/include/libkern/OSAtomicDeprecated.h:645:9: note: 'OSAtomicCompareAndSwap64Barrier' has been explicitly marked deprecated here
bool    OSAtomicCompareAndSwap64Barrier( int64_t __oldValue, int64_t __newValue,
        ^
3 warnings generated.
/Applications/Xcode.app/Contents/Developer/Toolchains/XcodeDefault.xctoolchain/usr/bin/ranlib: file: ../../../binaries/system/liblowlevel_dbg.a(dbghelp.o) has no symbols
/Applications/Xcode.app/Contents/Developer/Toolchains/XcodeDefault.xctoolchain/usr/bin/ranlib: file: ../../../binaries/system/liblowlevel_dbg.a(file_stats.o) has no symbols
/Applications/Xcode.app/Contents/Developer/Toolchains/XcodeDefault.xctoolchain/usr/bin/ranlib: file: ../../../binaries/system/liblowlevel_dbg.a(vfs_path.o) has no symbols
ld: warning: text-based stub file /System/Library/Frameworks//CoreServices.framework/CoreServices.tbd and library file /System/Library/Frameworks//CoreServices.framework/CoreServices are out of sync. Falling back to library file for linking.
ld: warning: text-based stub file /System/Library/Frameworks//CFNetwork.framework/Versions/A/CFNetwork.tbd and library file /System/Library/Frameworks//CFNetwork.framework/Versions/A/CFNetwork are out of sync. Falling back to library file for linking.
ld: warning: text-based stub file /System/Library/Frameworks/CoreServices.framework/Versions/A/Frameworks/FSEvents.framework/Versions/A/FSEvents.tbd and library file /System/Library/Frameworks/CoreServices.framework/Versions/A/Frameworks/FSEvents.framework/Versions/A/FSEvents are out of sync. Falling back to library file for linking.
ld: warning: text-based stub file /System/Library/Frameworks/CoreServices.framework/Versions/A/Frameworks/CarbonCore.framework/Versions/A/CarbonCore.tbd and library file /System/Library/Frameworks/CoreServices.framework/Versions/A/Frameworks/CarbonCore.framework/Versions/A/CarbonCore are out of sync. Falling back to library file for linking.
ld: warning: text-based stub file /System/Library/Frameworks/CoreServices.framework/Versions/A/Frameworks/Metadata.framework/Versions/A/Metadata.tbd and library file /System/Library/Frameworks/CoreServices.framework/Versions/A/Frameworks/Metadata.framework/Versions/A/Metadata are out of sync. Falling back to library file for linking.
ld: warning: text-based stub file /System/Library/Frameworks/CoreServices.framework/Versions/A/Frameworks/OSServices.framework/Versions/A/OSServices.tbd and library file /System/Library/Frameworks/CoreServices.framework/Versions/A/Frameworks/OSServices.framework/Versions/A/OSServices are out of sync. Falling back to library file for linking.
ld: warning: text-based stub file /System/Library/Frameworks/CoreServices.framework/Versions/A/Frameworks/SearchKit.framework/Versions/A/SearchKit.tbd and library file /System/Library/Frameworks/CoreServices.framework/Versions/A/Frameworks/SearchKit.framework/Versions/A/SearchKit are out of sync. Falling back to library file for linking.
ld: warning: text-based stub file /System/Library/Frameworks//CoreFoundation.framework/Versions/A/CoreFoundation.tbd and library file /System/Library/Frameworks//CoreFoundation.framework/Versions/A/CoreFoundation are out of sync. Falling back to library file for linking.
ld: warning: text-based stub file /System/Library/Frameworks/CoreServices.framework/Versions/A/Frameworks/AE.framework/Versions/A/AE.tbd and library file /System/Library/Frameworks/CoreServices.framework/Versions/A/Frameworks/AE.framework/Versions/A/AE are out of sync. Falling back to library file for linking.
ld: warning: text-based stub file /System/Library/Frameworks/CoreServices.framework/Versions/A/Frameworks/LaunchServices.framework/Versions/A/LaunchServices.tbd and library file /System/Library/Frameworks/CoreServices.framework/Versions/A/Frameworks/LaunchServices.framework/Versions/A/LaunchServices are out of sync. Falling back to library file for linking.
ld: warning: text-based stub file /System/Library/Frameworks/CoreServices.framework/Versions/A/Frameworks/DictionaryServices.framework/Versions/A/DictionaryServices.tbd and library file /System/Library/Frameworks/CoreServices.framework/Versions/A/Frameworks/DictionaryServices.framework/Versions/A/DictionaryServices are out of sync. Falling back to library file for linking.
ld: warning: text-based stub file /System/Library/Frameworks/CoreServices.framework/Versions/A/Frameworks/SharedFileList.framework/Versions/A/SharedFileList.tbd and library file /System/Library/Frameworks/CoreServices.framework/Versions/A/Frameworks/SharedFileList.framework/Versions/A/SharedFileList are out of sync. Falling back to library file for linking.
ld: warning: text-based stub file /System/Library/Frameworks//CoreAudio.framework/CoreAudio.tbd and library file /System/Library/Frameworks//CoreAudio.framework/CoreAudio are out of sync. Falling back to library file for linking.
ld: warning: text-based stub file /System/Library/Frameworks//AudioToolbox.framework/AudioToolbox.tbd and library file /System/Library/Frameworks//AudioToolbox.framework/AudioToolbox are out of sync. Falling back to library file for linking.
ld: warning: text-based stub file /System/Library/Frameworks//ForceFeedback.framework/ForceFeedback.tbd and library file /System/Library/Frameworks//ForceFeedback.framework/ForceFeedback are out of sync. Falling back to library file for linking.
ld: warning: text-based stub file /System/Library/Frameworks//CoreVideo.framework/CoreVideo.tbd and library file /System/Library/Frameworks//CoreVideo.framework/CoreVideo are out of sync. Falling back to library file for linking.
ld: warning: text-based stub file /System/Library/Frameworks//Cocoa.framework/Cocoa.tbd and library file /System/Library/Frameworks//Cocoa.framework/Cocoa are out of sync. Falling back to library file for linking.
ld: warning: text-based stub file /System/Library/Frameworks//IOKit.framework/IOKit.tbd and library file /System/Library/Frameworks//IOKit.framework/IOKit are out of sync. Falling back to library file for linking.
ld: warning: text-based stub file /System/Library/Frameworks//QuartzCore.framework/QuartzCore.tbd and library file /System/Library/Frameworks//QuartzCore.framework/QuartzCore are out of sync. Falling back to library file for linking.
ld: warning: text-based stub file /System/Library/Frameworks//Metal.framework/Metal.tbd and library file /System/Library/Frameworks//Metal.framework/Metal are out of sync. Falling back to library file for linking.
ld: warning: text-based stub file /System/Library/Frameworks//OpenGL.framework/OpenGL.tbd and library file /System/Library/Frameworks//OpenGL.framework/OpenGL are out of sync. Falling back to library file for linking.
ld: warning: text-based stub file /System/Library/Frameworks//Security.framework/Security.tbd and library file /System/Library/Frameworks//Security.framework/Security are out of sync. Falling back to library file for linking.
ld: warning: text-based stub file /System/Library/Frameworks//OpenAL.framework/OpenAL.tbd and library file /System/Library/Frameworks//OpenAL.framework/OpenAL are out of sync. Falling back to library file for linking.
ld: warning: text-based stub file /System/Library/Frameworks//ApplicationServices.framework/ApplicationServices.tbd and library file /System/Library/Frameworks//ApplicationServices.framework/ApplicationServices are out of sync. Falling back to library file for linking.
ld: warning: text-based stub file /System/Library/Frameworks//Cocoa.framework/Cocoa.tbd and library file /System/Library/Frameworks//Cocoa.framework/Cocoa are out of sync. Falling back to library file for linking.
ld: warning: text-based stub file /System/Library/Frameworks//CoreFoundation.framework/CoreFoundation.tbd and library file /System/Library/Frameworks//CoreFoundation.framework/CoreFoundation are out of sync. Falling back to library file for linking.
ld: warning: text-based stub file /System/Library/Frameworks//AppKit.framework/Versions/C/AppKit.tbd and library file /System/Library/Frameworks//AppKit.framework/Versions/C/AppKit are out of sync. Falling back to library file for linking.
ld: warning: text-based stub file /System/Library/Frameworks//CoreData.framework/Versions/A/CoreData.tbd and library file /System/Library/Frameworks//CoreData.framework/Versions/A/CoreData are out of sync. Falling back to library file for linking.
ld: warning: text-based stub file /System/Library/Frameworks/Carbon.framework/Versions/A/Frameworks/CommonPanels.framework/Versions/A/CommonPanels.tbd and library file /System/Library/Frameworks/Carbon.framework/Versions/A/Frameworks/CommonPanels.framework/Versions/A/CommonPanels are out of sync. Falling back to library file for linking.
ld: warning: text-based stub file /System/Library/Frameworks/Carbon.framework/Versions/A/Frameworks/HIToolbox.framework/Versions/A/HIToolbox.tbd and library file /System/Library/Frameworks/Carbon.framework/Versions/A/Frameworks/HIToolbox.framework/Versions/A/HIToolbox are out of sync. Falling back to library file for linking.
ld: warning: text-based stub file /System/Library/Frameworks/Carbon.framework/Versions/A/Frameworks/Help.framework/Versions/A/Help.tbd and library file /System/Library/Frameworks/Carbon.framework/Versions/A/Frameworks/Help.framework/Versions/A/Help are out of sync. Falling back to library file for linking.
ld: warning: text-based stub file /System/Library/Frameworks/Carbon.framework/Versions/A/Frameworks/ImageCapture.framework/Versions/A/ImageCapture.tbd and library file /System/Library/Frameworks/Carbon.framework/Versions/A/Frameworks/ImageCapture.framework/Versions/A/ImageCapture are out of sync. Falling back to library file for linking.
ld: warning: text-based stub file /System/Library/Frameworks/Carbon.framework/Versions/A/Frameworks/Ink.framework/Versions/A/Ink.tbd and library file /System/Library/Frameworks/Carbon.framework/Versions/A/Frameworks/Ink.framework/Versions/A/Ink are out of sync. Falling back to library file for linking.
ld: warning: text-based stub file /System/Library/Frameworks/Carbon.framework/Versions/A/Frameworks/OpenScripting.framework/Versions/A/OpenScripting.tbd and library file /System/Library/Frameworks/Carbon.framework/Versions/A/Frameworks/OpenScripting.framework/Versions/A/OpenScripting are out of sync. Falling back to library file for linking.
ld: warning: text-based stub file /System/Library/Frameworks/Carbon.framework/Versions/A/Frameworks/Print.framework/Versions/A/Print.tbd and library file /System/Library/Frameworks/Carbon.framework/Versions/A/Frameworks/Print.framework/Versions/A/Print are out of sync. Falling back to library file for linking.
ld: warning: text-based stub file /System/Library/Frameworks/Carbon.framework/Versions/A/Frameworks/SecurityHI.framework/Versions/A/SecurityHI.tbd and library file /System/Library/Frameworks/Carbon.framework/Versions/A/Frameworks/SecurityHI.framework/Versions/A/SecurityHI are out of sync. Falling back to library file for linking.
ld: warning: text-based stub file /System/Library/Frameworks/Carbon.framework/Versions/A/Frameworks/SpeechRecognition.framework/Versions/A/SpeechRecognition.tbd and library file /System/Library/Frameworks/Carbon.framework/Versions/A/Frameworks/SpeechRecognition.framework/Versions/A/SpeechRecognition are out of sync. Falling back to library file for linking.
ld: warning: text-based stub file /System/Library/Frameworks/OpenGL.framework/Versions/A/Libraries/libGLU.tbd and library file /System/Library/Frameworks/OpenGL.framework/Versions/A/Libraries/libGLU.dylib are out of sync. Falling back to library file for linking.
ld: warning: text-based stub file /System/Library/Frameworks/OpenGL.framework/Versions/A/Libraries/libGL.tbd and library file /System/Library/Frameworks/OpenGL.framework/Versions/A/Libraries/libGL.dylib are out of sync. Falling back to library file for linking.
ld: warning: text-based stub file /System/Library/Frameworks//CoreGraphics.framework/Versions/A/CoreGraphics.tbd and library file /System/Library/Frameworks//CoreGraphics.framework/Versions/A/CoreGraphics are out of sync. Falling back to library file for linking.
ld: warning: text-based stub file /System/Library/Frameworks//CoreText.framework/Versions/A/CoreText.tbd and library file /System/Library/Frameworks//CoreText.framework/Versions/A/CoreText are out of sync. Falling back to library file for linking.
ld: warning: text-based stub file /System/Library/Frameworks//ImageIO.framework/Versions/A/ImageIO.tbd and library file /System/Library/Frameworks//ImageIO.framework/Versions/A/ImageIO are out of sync. Falling back to library file for linking.
ld: warning: text-based stub file /System/Library/Frameworks//ColorSync.framework/Versions/A/ColorSync.tbd and library file /System/Library/Frameworks//ColorSync.framework/Versions/A/ColorSync are out of sync. Falling back to library file for linking.
ld: warning: text-based stub file /System/Library/Frameworks/ApplicationServices.framework/Versions/A/Frameworks/ATS.framework/Versions/A/ATS.tbd and library file /System/Library/Frameworks/ApplicationServices.framework/Versions/A/Frameworks/ATS.framework/Versions/A/ATS are out of sync. Falling back to library file for linking.
ld: warning: text-based stub file /System/Library/Frameworks/ApplicationServices.framework/Versions/A/Frameworks/ColorSyncLegacy.framework/Versions/A/ColorSyncLegacy.tbd and library file /System/Library/Frameworks/ApplicationServices.framework/Versions/A/Frameworks/ColorSyncLegacy.framework/Versions/A/ColorSyncLegacy are out of sync. Falling back to library file for linking.
ld: warning: text-based stub file /System/Library/Frameworks//CoreServices.framework/Versions/A/CoreServices.tbd and library file /System/Library/Frameworks//CoreServices.framework/Versions/A/CoreServices are out of sync. Falling back to library file for linking.
ld: warning: text-based stub file /System/Library/Frameworks/ApplicationServices.framework/Versions/A/Frameworks/HIServices.framework/Versions/A/HIServices.tbd and library file /System/Library/Frameworks/ApplicationServices.framework/Versions/A/Frameworks/HIServices.framework/Versions/A/HIServices are out of sync. Falling back to library file for linking.
ld: warning: text-based stub file /System/Library/Frameworks/ApplicationServices.framework/Versions/A/Frameworks/LangAnalysis.framework/Versions/A/LangAnalysis.tbd and library file /System/Library/Frameworks/ApplicationServices.framework/Versions/A/Frameworks/LangAnalysis.framework/Versions/A/LangAnalysis are out of sync. Falling back to library file for linking.
ld: warning: text-based stub file /System/Library/Frameworks/ApplicationServices.framework/Versions/A/Frameworks/PrintCore.framework/Versions/A/PrintCore.tbd and library file /System/Library/Frameworks/ApplicationServices.framework/Versions/A/Frameworks/PrintCore.framework/Versions/A/PrintCore are out of sync. Falling back to library file for linking.
ld: warning: text-based stub file /System/Library/Frameworks/ApplicationServices.framework/Versions/A/Frameworks/QD.framework/Versions/A/QD.tbd and library file /System/Library/Frameworks/ApplicationServices.framework/Versions/A/Frameworks/QD.framework/Versions/A/QD are out of sync. Falling back to library file for linking.
ld: warning: text-based stub file /System/Library/Frameworks/ApplicationServices.framework/Versions/A/Frameworks/SpeechSynthesis.framework/Versions/A/SpeechSynthesis.tbd and library file /System/Library/Frameworks/ApplicationServices.framework/Versions/A/Frameworks/SpeechSynthesis.framework/Versions/A/SpeechSynthesis are out of sync. Falling back to library file for linking.
ld: warning: text-based stub file /System/Library/Frameworks//CoreImage.framework/Versions/A/CoreImage.tbd and library file /System/Library/Frameworks//CoreImage.framework/Versions/A/CoreImage are out of sync. Falling back to library file for linking.
ld: warning: text-based stub file /System/Library/PrivateFrameworks/UIFoundation.framework/Versions/A/UIFoundation.tbd and library file /System/Library/PrivateFrameworks/UIFoundation.framework/Versions/A/UIFoundation are out of sync. Falling back to library file for linking.
ld: warning: text-based stub file /System/Library/Frameworks//Foundation.framework/Versions/C/Foundation.tbd and library file /System/Library/Frameworks//Foundation.framework/Versions/C/Foundation are out of sync. Falling back to library file for linking.
ld: warning: text-based stub file /System/Library/Frameworks//CFNetwork.framework/Versions/A/CFNetwork.tbd and library file /System/Library/Frameworks//CFNetwork.framework/Versions/A/CFNetwork are out of sync. Falling back to library file for linking.
ld: warning: text-based stub file /System/Library/Frameworks/CoreServices.framework/Versions/A/Frameworks/FSEvents.framework/Versions/A/FSEvents.tbd and library file /System/Library/Frameworks/CoreServices.framework/Versions/A/Frameworks/FSEvents.framework/Versions/A/FSEvents are out of sync. Falling back to library file for linking.
ld: warning: text-based stub file /System/Library/Frameworks/CoreServices.framework/Versions/A/Frameworks/CarbonCore.framework/Versions/A/CarbonCore.tbd and library file /System/Library/Frameworks/CoreServices.framework/Versions/A/Frameworks/CarbonCore.framework/Versions/A/CarbonCore are out of sync. Falling back to library file for linking.
ld: warning: text-based stub file /System/Library/Frameworks/CoreServices.framework/Versions/A/Frameworks/Metadata.framework/Versions/A/Metadata.tbd and library file /System/Library/Frameworks/CoreServices.framework/Versions/A/Frameworks/Metadata.framework/Versions/A/Metadata are out of sync. Falling back to library file for linking.
ld: warning: text-based stub file /System/Library/Frameworks/CoreServices.framework/Versions/A/Frameworks/OSServices.framework/Versions/A/OSServices.tbd and library file /System/Library/Frameworks/CoreServices.framework/Versions/A/Frameworks/OSServices.framework/Versions/A/OSServices are out of sync. Falling back to library file for linking.
ld: warning: text-based stub file /System/Library/Frameworks/CoreServices.framework/Versions/A/Frameworks/SearchKit.framework/Versions/A/SearchKit.tbd and library file /System/Library/Frameworks/CoreServices.framework/Versions/A/Frameworks/SearchKit.framework/Versions/A/SearchKit are out of sync. Falling back to library file for linking.
ld: warning: text-based stub file /System/Library/Frameworks/CoreServices.framework/Versions/A/Frameworks/AE.framework/Versions/A/AE.tbd and library file /System/Library/Frameworks/CoreServices.framework/Versions/A/Frameworks/AE.framework/Versions/A/AE are out of sync. Falling back to library file for linking.
ld: warning: text-based stub file /System/Library/Frameworks/CoreServices.framework/Versions/A/Frameworks/LaunchServices.framework/Versions/A/LaunchServices.tbd and library file /System/Library/Frameworks/CoreServices.framework/Versions/A/Frameworks/LaunchServices.framework/Versions/A/LaunchServices are out of sync. Falling back to library file for linking.
ld: warning: text-based stub file /System/Library/Frameworks/CoreServices.framework/Versions/A/Frameworks/DictionaryServices.framework/Versions/A/DictionaryServices.tbd and library file /System/Library/Frameworks/CoreServices.framework/Versions/A/Frameworks/DictionaryServices.framework/Versions/A/DictionaryServices are out of sync. Falling back to library file for linking.
ld: warning: text-based stub file /System/Library/Frameworks/CoreServices.framework/Versions/A/Frameworks/SharedFileList.framework/Versions/A/SharedFileList.tbd and library file /System/Library/Frameworks/CoreServices.framework/Versions/A/Frameworks/SharedFileList.framework/Versions/A/SharedFileList are out of sync. Falling back to library file for linking.
ld: warning: object file (../../../libraries/osx/fmt/lib/libfmt.a(format.cc.o)) was built for newer OSX version (10.13) than being linked (10.12)
ld: warning: text-based stub file /System/Library/Frameworks//CoreFoundation.framework/CoreFoundation.tbd and library file /System/Library/Frameworks//CoreFoundation.framework/CoreFoundation are out of sync. Falling back to library file for linking.
Undefined symbols for architecture x86_64:
  "CParamNode::ToUTF8() const", referenced from:
      CCmpUnitMotion::Init(CParamNode const&) in libsimulation2_dbg.a(CCmpUnitMotion.o)
ld: symbol(s) not found for architecture x86_64
clang: error: linker command failed with exit code 1 (use -v to see invocation)
make[1]: *** [../../../binaries/system/pyrogenesis_dbg] Error 1
make: *** [pyrogenesis] Error 2

Link to build: https://jenkins.wildfiregames.com/job/macos-differential/3923/display/redirect

Probably gonna put this on the back-burner, I don't actually need it for D3823 -> all I need is to parse JS into XMB, and that's just one function.
I'm not sure it would ever make too much sense to have arbitrary-named paramnodes, perhaps just an "array" node type would suffice.

The interface changes are nice IMO, & std::vector is likely a good idea, but I can do that later, the UTF8 conversion was actually most of the speedup here.

Build failure - The Moirai have given mortals hearts that can endure.

builderr-debug-gcc7.txt
In file included from ../../../source/simulation2/tests/test_ParamNode.cpp:17:
/zpool0/gcc7/source/simulation2/tests/test_ParamNode.h: In member function 'void TestParamNode::test_basicJS()':
/zpool0/gcc7/source/simulation2/tests/test_ParamNode.h:93:44: error: no matching function for call to 'CParamNode::LoadJS(CParamNode&, ScriptInterface&, JS::RootedValue&, std::__cxx11::string&)'
   CParamNode::LoadJS(node2, script, val, st);
                                            ^
In file included from ../../../source/simulation2/system/Component.h:25,
                 from ../../../source/simulation2/system/ComponentTest.h:26,
                 from ../../../source/pch/test/precompiled.h:22:
../../../source/simulation2/system/ParamNode.h:194:14: note: candidate: 'static bool CParamNode::LoadJS(CParamNode&, const ScriptInterface&, JS::HandleValue)'
  static bool LoadJS(CParamNode& ret, const ScriptInterface& scriptInterface, JS::HandleValue value);
              ^~~~~~
../../../source/simulation2/system/ParamNode.h:194:14: note:   candidate expects 3 arguments, 4 provided
make[1]: *** [test.make:1385: obj/test_Debug/test_ParamNode.o] Error 1
make: *** [Makefile:197: test] Error 2

Link to build: https://jenkins.wildfiregames.com/job/docker-differential/5632/display/redirect

wraitii planned changes to this revision.Sat, Apr 24, 10:24 AM