Page MenuHomeWildfire Games

Ignore broken symlinks
Needs ReviewPublic

Authored by phosit on Jul 24 2022, 10:00 PM.
This revision needs review, but there are no reviewers specified.

Details

Reviewers
None
Trac Tickets
#6586
Summary

Log a warning and continue with the next folder.

Test Plan
  • make a symlink from inside the mod folder
  • delete the linked file (so the symlink becoms dangling)
  • start 0ad

Event Timeline

phosit created this revision.Jul 24 2022, 10:00 PM

Build failure - The Moirai have given mortals hearts that can endure.

builderr-debug-macos.txt
/Applications/Xcode.app/Contents/Developer/Toolchains/XcodeDefault.xctoolchain/usr/bin/ranlib: file: ../../../binaries/system/libsimulation2_dbg.a(precompiled.o) has no symbols
/Applications/Xcode.app/Contents/Developer/Toolchains/XcodeDefault.xctoolchain/usr/bin/ranlib: file: ../../../binaries/system/libgraphics_dbg.a(precompiled.o) has no symbols
../../../source/lib/file/file_system.cpp:126:5: error: use of undeclared identifier 'LOGWARNING'
                                LOGWARNING("%s is a dangling symbolic link",
                                ^
1 error generated.
make[1]: *** [obj/lowlevel_Debug/file_system.o] Error 1
make: *** [lowlevel] Error 2

Link to build: https://jenkins.wildfiregames.com/job/macos-differential/6267/display/redirect

Successful build - Chance fights ever on the side of the prudent.

Debug:
    17>wsecure_crt.obj : warning LNK4221: This object file does not define any previously undefined public symbols, so it will not be used by any link operation that consumes this library [E:\Jenkins\workspace\vs2015-differential\build\workspaces\vs2017\lowlevel.vcxproj]
    17>wprofiler.obj : warning LNK4221: This object file does not define any previously undefined public symbols, so it will not be used by any link operation that consumes this library [E:\Jenkins\workspace\vs2015-differential\build\workspaces\vs2017\lowlevel.vcxproj]
    17>manifest.obj : warning LNK4221: This object file does not define any previously undefined public symbols, so it will not be used by any link operation that consumes this library [E:\Jenkins\workspace\vs2015-differential\build\workspaces\vs2017\lowlevel.vcxproj]
    17>secure_crt.obj : warning LNK4221: This object file does not define any previously undefined public symbols, so it will not be used by any link operation that consumes this library [E:\Jenkins\workspace\vs2015-differential\build\workspaces\vs2017\lowlevel.vcxproj]
    17>posix.obj : warning LNK4221: This object file does not define any previously undefined public symbols, so it will not be used by any link operation that consumes this library [E:\Jenkins\workspace\vs2015-differential\build\workspaces\vs2017\lowlevel.vcxproj]
    17>vfs_path.obj : warning LNK4221: This object file does not define any previously undefined public symbols, so it will not be used by any link operation that consumes this library [E:\Jenkins\workspace\vs2015-differential\build\workspaces\vs2017\lowlevel.vcxproj]
    17>file_stats.obj : warning LNK4221: This object file does not define any previously undefined public symbols, so it will not be used by any link operation that consumes this library [E:\Jenkins\workspace\vs2015-differential\build\workspaces\vs2017\lowlevel.vcxproj]

Link to build: https://jenkins.wildfiregames.com/job/vs2015-differential/7357/display/redirect

phosit requested review of this revision.Jul 24 2022, 10:20 PM
phosit updated this revision to Diff 20661.Jul 24 2022, 10:35 PM

Include logger

Successful build - Chance fights ever on the side of the prudent.

Debug:
    17>wsecure_crt.obj : warning LNK4221: This object file does not define any previously undefined public symbols, so it will not be used by any link operation that consumes this library [E:\Jenkins\workspace\vs2015-differential\build\workspaces\vs2017\lowlevel.vcxproj]
    17>wprofiler.obj : warning LNK4221: This object file does not define any previously undefined public symbols, so it will not be used by any link operation that consumes this library [E:\Jenkins\workspace\vs2015-differential\build\workspaces\vs2017\lowlevel.vcxproj]
    17>manifest.obj : warning LNK4221: This object file does not define any previously undefined public symbols, so it will not be used by any link operation that consumes this library [E:\Jenkins\workspace\vs2015-differential\build\workspaces\vs2017\lowlevel.vcxproj]
    17>secure_crt.obj : warning LNK4221: This object file does not define any previously undefined public symbols, so it will not be used by any link operation that consumes this library [E:\Jenkins\workspace\vs2015-differential\build\workspaces\vs2017\lowlevel.vcxproj]
    17>posix.obj : warning LNK4221: This object file does not define any previously undefined public symbols, so it will not be used by any link operation that consumes this library [E:\Jenkins\workspace\vs2015-differential\build\workspaces\vs2017\lowlevel.vcxproj]
    17>vfs_path.obj : warning LNK4221: This object file does not define any previously undefined public symbols, so it will not be used by any link operation that consumes this library [E:\Jenkins\workspace\vs2015-differential\build\workspaces\vs2017\lowlevel.vcxproj]
    17>file_stats.obj : warning LNK4221: This object file does not define any previously undefined public symbols, so it will not be used by any link operation that consumes this library [E:\Jenkins\workspace\vs2015-differential\build\workspaces\vs2017\lowlevel.vcxproj]

Link to build: https://jenkins.wildfiregames.com/job/vs2015-differential/7358/display/redirect

Successful build - Chance fights ever on the side of the prudent.

builderr-debug-macos.txt
/Applications/Xcode.app/Contents/Developer/Toolchains/XcodeDefault.xctoolchain/usr/bin/ranlib: file: ../../../binaries/system/liblowlevel_dbg.a(dbghelp.o) has no symbols
/Applications/Xcode.app/Contents/Developer/Toolchains/XcodeDefault.xctoolchain/usr/bin/ranlib: file: ../../../binaries/system/liblowlevel_dbg.a(file_stats.o) has no symbols
/Applications/Xcode.app/Contents/Developer/Toolchains/XcodeDefault.xctoolchain/usr/bin/ranlib: file: ../../../binaries/system/liblowlevel_dbg.a(vfs_path.o) has no symbols
/Applications/Xcode.app/Contents/Developer/Toolchains/XcodeDefault.xctoolchain/usr/bin/ranlib: file: ../../../binaries/system/liblowlevel_dbg.a(gfx.o) has no symbols
ld: warning: text-based stub file /System/Library/Frameworks//CoreAudio.framework/CoreAudio.tbd and library file /System/Library/Frameworks//CoreAudio.framework/CoreAudio are out of sync. Falling back to library file for linking.
ld: warning: text-based stub file /System/Library/Frameworks//AudioToolbox.framework/AudioToolbox.tbd and library file /System/Library/Frameworks//AudioToolbox.framework/AudioToolbox are out of sync. Falling back to library file for linking.
ld: warning: text-based stub file /System/Library/Frameworks//ForceFeedback.framework/ForceFeedback.tbd and library file /System/Library/Frameworks//ForceFeedback.framework/ForceFeedback are out of sync. Falling back to library file for linking.
ld: warning: text-based stub file /System/Library/Frameworks//CoreVideo.framework/CoreVideo.tbd and library file /System/Library/Frameworks//CoreVideo.framework/CoreVideo are out of sync. Falling back to library file for linking.
ld: warning: text-based stub file /System/Library/Frameworks//Cocoa.framework/Cocoa.tbd and library file /System/Library/Frameworks//Cocoa.framework/Cocoa are out of sync. Falling back to library file for linking.
ld: warning: text-based stub file /System/Library/Frameworks//IOKit.framework/IOKit.tbd and library file /System/Library/Frameworks//IOKit.framework/IOKit are out of sync. Falling back to library file for linking.
ld: warning: text-based stub file /System/Library/Frameworks//QuartzCore.framework/QuartzCore.tbd and library file /System/Library/Frameworks//QuartzCore.framework/QuartzCore are out of sync. Falling back to library file for linking.
ld: warning: text-based stub file /System/Library/Frameworks//Metal.framework/Metal.tbd and library file /System/Library/Frameworks//Metal.framework/Metal are out of sync. Falling back to library file for linking.
ld: warning: text-based stub file /System/Library/Frameworks//Security.framework/Security.tbd and library file /System/Library/Frameworks//Security.framework/Security are out of sync. Falling back to library file for linking.
ld: warning: text-based stub file /System/Library/Frameworks//OpenAL.framework/OpenAL.tbd and library file /System/Library/Frameworks//OpenAL.framework/OpenAL are out of sync. Falling back to library file for linking.
ld: warning: text-based stub file /System/Library/Frameworks//ApplicationServices.framework/ApplicationServices.tbd and library file /System/Library/Frameworks//ApplicationServices.framework/ApplicationServices are out of sync. Falling back to library file for linking.
ld: warning: text-based stub file /System/Library/Frameworks//Cocoa.framework/Cocoa.tbd and library file /System/Library/Frameworks//Cocoa.framework/Cocoa are out of sync. Falling back to library file for linking.
ld: warning: text-based stub file /System/Library/Frameworks//CoreFoundation.framework/CoreFoundation.tbd and library file /System/Library/Frameworks//CoreFoundation.framework/CoreFoundation are out of sync. Falling back to library file for linking.
ld: warning: text-based stub file /System/Library/Frameworks//AppKit.framework/Versions/C/AppKit.tbd and library file /System/Library/Frameworks//AppKit.framework/Versions/C/AppKit are out of sync. Falling back to library file for linking.
ld: warning: text-based stub file /System/Library/Frameworks//CoreData.framework/Versions/A/CoreData.tbd and library file /System/Library/Frameworks//CoreData.framework/Versions/A/CoreData are out of sync. Falling back to library file for linking.
ld: warning: text-based stub file /System/Library/Frameworks/Carbon.framework/Versions/A/Frameworks/CommonPanels.framework/Versions/A/CommonPanels.tbd and library file /System/Library/Frameworks/Carbon.framework/Versions/A/Frameworks/CommonPanels.framework/Versions/A/CommonPanels are out of sync. Falling back to library file for linking.
ld: warning: text-based stub file /System/Library/Frameworks/Carbon.framework/Versions/A/Frameworks/HIToolbox.framework/Versions/A/HIToolbox.tbd and library file /System/Library/Frameworks/Carbon.framework/Versions/A/Frameworks/HIToolbox.framework/Versions/A/HIToolbox are out of sync. Falling back to library file for linking.
ld: warning: text-based stub file /System/Library/Frameworks/Carbon.framework/Versions/A/Frameworks/Help.framework/Versions/A/Help.tbd and library file /System/Library/Frameworks/Carbon.framework/Versions/A/Frameworks/Help.framework/Versions/A/Help are out of sync. Falling back to library file for linking.
ld: warning: text-based stub file /System/Library/Frameworks/Carbon.framework/Versions/A/Frameworks/ImageCapture.framework/Versions/A/ImageCapture.tbd and library file /System/Library/Frameworks/Carbon.framework/Versions/A/Frameworks/ImageCapture.framework/Versions/A/ImageCapture are out of sync. Falling back to library file for linking.
ld: warning: text-based stub file /System/Library/Frameworks/Carbon.framework/Versions/A/Frameworks/Ink.framework/Versions/A/Ink.tbd and library file /System/Library/Frameworks/Carbon.framework/Versions/A/Frameworks/Ink.framework/Versions/A/Ink are out of sync. Falling back to library file for linking.
ld: warning: text-based stub file /System/Library/Frameworks/Carbon.framework/Versions/A/Frameworks/OpenScripting.framework/Versions/A/OpenScripting.tbd and library file /System/Library/Frameworks/Carbon.framework/Versions/A/Frameworks/OpenScripting.framework/Versions/A/OpenScripting are out of sync. Falling back to library file for linking.
ld: warning: text-based stub file /System/Library/Frameworks/Carbon.framework/Versions/A/Frameworks/Print.framework/Versions/A/Print.tbd and library file /System/Library/Frameworks/Carbon.framework/Versions/A/Frameworks/Print.framework/Versions/A/Print are out of sync. Falling back to library file for linking.
ld: warning: text-based stub file /System/Library/Frameworks/Carbon.framework/Versions/A/Frameworks/SecurityHI.framework/Versions/A/SecurityHI.tbd and library file /System/Library/Frameworks/Carbon.framework/Versions/A/Frameworks/SecurityHI.framework/Versions/A/SecurityHI are out of sync. Falling back to library file for linking.
ld: warning: text-based stub file /System/Library/Frameworks/Carbon.framework/Versions/A/Frameworks/SpeechRecognition.framework/Versions/A/SpeechRecognition.tbd and library file /System/Library/Frameworks/Carbon.framework/Versions/A/Frameworks/SpeechRecognition.framework/Versions/A/SpeechRecognition are out of sync. Falling back to library file for linking.
ld: warning: text-based stub file /System/Library/Frameworks//CoreImage.framework/Versions/A/CoreImage.tbd and library file /System/Library/Frameworks//CoreImage.framework/Versions/A/CoreImage are out of sync. Falling back to library file for linking.
ld: warning: text-based stub file /System/Library/Frameworks//CoreGraphics.framework/Versions/A/CoreGraphics.tbd and library file /System/Library/Frameworks//CoreGraphics.framework/Versions/A/CoreGraphics are out of sync. Falling back to library file for linking.
ld: warning: text-based stub file /System/Library/Frameworks//CoreText.framework/Versions/A/CoreText.tbd and library file /System/Library/Frameworks//CoreText.framework/Versions/A/CoreText are out of sync. Falling back to library file for linking.
ld: warning: text-based stub file /System/Library/Frameworks//ImageIO.framework/Versions/A/ImageIO.tbd and library file /System/Library/Frameworks//ImageIO.framework/Versions/A/ImageIO are out of sync. Falling back to library file for linking.
ld: warning: text-based stub file /System/Library/Frameworks//ColorSync.framework/Versions/A/ColorSync.tbd and library file /System/Library/Frameworks//ColorSync.framework/Versions/A/ColorSync are out of sync. Falling back to library file for linking.
ld: warning: text-based stub file /System/Library/Frameworks/ApplicationServices.framework/Versions/A/Frameworks/ATS.framework/Versions/A/ATS.tbd and library file /System/Library/Frameworks/ApplicationServices.framework/Versions/A/Frameworks/ATS.framework/Versions/A/ATS are out of sync. Falling back to library file for linking.
ld: warning: text-based stub file /System/Library/Frameworks/ApplicationServices.framework/Versions/A/Frameworks/ColorSyncLegacy.framework/Versions/A/ColorSyncLegacy.tbd and library file /System/Library/Frameworks/ApplicationServices.framework/Versions/A/Frameworks/ColorSyncLegacy.framework/Versions/A/ColorSyncLegacy are out of sync. Falling back to library file for linking.
ld: warning: text-based stub file /System/Library/Frameworks//CoreServices.framework/Versions/A/CoreServices.tbd and library file /System/Library/Frameworks//CoreServices.framework/Versions/A/CoreServices are out of sync. Falling back to library file for linking.
ld: warning: text-based stub file /System/Library/Frameworks/ApplicationServices.framework/Versions/A/Frameworks/HIServices.framework/Versions/A/HIServices.tbd and library file /System/Library/Frameworks/ApplicationServices.framework/Versions/A/Frameworks/HIServices.framework/Versions/A/HIServices are out of sync. Falling back to library file for linking.
ld: warning: text-based stub file /System/Library/Frameworks/ApplicationServices.framework/Versions/A/Frameworks/LangAnalysis.framework/Versions/A/LangAnalysis.tbd and library file /System/Library/Frameworks/ApplicationServices.framework/Versions/A/Frameworks/LangAnalysis.framework/Versions/A/LangAnalysis are out of sync. Falling back to library file for linking.
ld: warning: text-based stub file /System/Library/Frameworks/ApplicationServices.framework/Versions/A/Frameworks/PrintCore.framework/Versions/A/PrintCore.tbd and library file /System/Library/Frameworks/ApplicationServices.framework/Versions/A/Frameworks/PrintCore.framework/Versions/A/PrintCore are out of sync. Falling back to library file for linking.
ld: warning: text-based stub file /System/Library/Frameworks/ApplicationServices.framework/Versions/A/Frameworks/QD.framework/Versions/A/QD.tbd and library file /System/Library/Frameworks/ApplicationServices.framework/Versions/A/Frameworks/QD.framework/Versions/A/QD are out of sync. Falling back to library file for linking.
ld: warning: text-based stub file /System/Library/Frameworks/ApplicationServices.framework/Versions/A/Frameworks/SpeechSynthesis.framework/Versions/A/SpeechSynthesis.tbd and library file /System/Library/Frameworks/ApplicationServices.framework/Versions/A/Frameworks/SpeechSynthesis.framework/Versions/A/SpeechSynthesis are out of sync. Falling back to library file for linking.
ld: warning: text-based stub file /System/Library/PrivateFrameworks/UIFoundation.framework/Versions/A/UIFoundation.tbd and library file /System/Library/PrivateFrameworks/UIFoundation.framework/Versions/A/UIFoundation are out of sync. Falling back to library file for linking.
ld: warning: text-based stub file /System/Library/Frameworks//Foundation.framework/Versions/C/Foundation.tbd and library file /System/Library/Frameworks//Foundation.framework/Versions/C/Foundation are out of sync. Falling back to library file for linking.
ld: warning: text-based stub file /System/Library/Frameworks//CFNetwork.framework/Versions/A/CFNetwork.tbd and library file /System/Library/Frameworks//CFNetwork.framework/Versions/A/CFNetwork are out of sync. Falling back to library file for linking.
ld: warning: text-based stub file /System/Library/Frameworks/CoreServices.framework/Versions/A/Frameworks/FSEvents.framework/Versions/A/FSEvents.tbd and library file /System/Library/Frameworks/CoreServices.framework/Versions/A/Frameworks/FSEvents.framework/Versions/A/FSEvents are out of sync. Falling back to library file for linking.
ld: warning: text-based stub file /System/Library/Frameworks/CoreServices.framework/Versions/A/Frameworks/CarbonCore.framework/Versions/A/CarbonCore.tbd and library file /System/Library/Frameworks/CoreServices.framework/Versions/A/Frameworks/CarbonCore.framework/Versions/A/CarbonCore are out of sync. Falling back to library file for linking.
ld: warning: text-based stub file /System/Library/Frameworks/CoreServices.framework/Versions/A/Frameworks/Metadata.framework/Versions/A/Metadata.tbd and library file /System/Library/Frameworks/CoreServices.framework/Versions/A/Frameworks/Metadata.framework/Versions/A/Metadata are out of sync. Falling back to library file for linking.
ld: warning: text-based stub file /System/Library/Frameworks/CoreServices.framework/Versions/A/Frameworks/OSServices.framework/Versions/A/OSServices.tbd and library file /System/Library/Frameworks/CoreServices.framework/Versions/A/Frameworks/OSServices.framework/Versions/A/OSServices are out of sync. Falling back to library file for linking.
ld: warning: text-based stub file /System/Library/Frameworks/CoreServices.framework/Versions/A/Frameworks/SearchKit.framework/Versions/A/SearchKit.tbd and library file /System/Library/Frameworks/CoreServices.framework/Versions/A/Frameworks/SearchKit.framework/Versions/A/SearchKit are out of sync. Falling back to library file for linking.
ld: warning: text-based stub file /System/Library/Frameworks/CoreServices.framework/Versions/A/Frameworks/AE.framework/Versions/A/AE.tbd and library file /System/Library/Frameworks/CoreServices.framework/Versions/A/Frameworks/AE.framework/Versions/A/AE are out of sync. Falling back to library file for linking.
ld: warning: text-based stub file /System/Library/Frameworks/CoreServices.framework/Versions/A/Frameworks/LaunchServices.framework/Versions/A/LaunchServices.tbd and library file /System/Library/Frameworks/CoreServices.framework/Versions/A/Frameworks/LaunchServices.framework/Versions/A/LaunchServices are out of sync. Falling back to library file for linking.
ld: warning: text-based stub file /System/Library/Frameworks/CoreServices.framework/Versions/A/Frameworks/DictionaryServices.framework/Versions/A/DictionaryServices.tbd and library file /System/Library/Frameworks/CoreServices.framework/Versions/A/Frameworks/DictionaryServices.framework/Versions/A/DictionaryServices are out of sync. Falling back to library file for linking.
ld: warning: text-based stub file /System/Library/Frameworks/CoreServices.framework/Versions/A/Frameworks/SharedFileList.framework/Versions/A/SharedFileList.tbd and library file /System/Library/Frameworks/CoreServices.framework/Versions/A/Frameworks/SharedFileList.framework/Versions/A/SharedFileList are out of sync. Falling back to library file for linking.
ld: warning: object file (../../../libraries/osx/fmt/lib/libfmt.a(format.cc.o)) was built for newer OSX version (10.13) than being linked (10.12)
ld: warning: text-based stub file /System/Library/Frameworks//CoreFoundation.framework/CoreFoundation.tbd and library file /System/Library/Frameworks//CoreFoundation.framework/CoreFoundation are out of sync. Falling back to library file for linking.
ld: warning: text-based stub file /System/Library/Frameworks//CoreAudio.framework/CoreAudio.tbd and library file /System/Library/Frameworks//CoreAudio.framework/CoreAudio are out of sync. Falling back to library file for linking.
ld: warning: text-based stub file /System/Library/Frameworks//AudioToolbox.framework/AudioToolbox.tbd and library file /System/Library/Frameworks//AudioToolbox.framework/AudioToolbox are out of sync. Falling back to library file for linking.
ld: warning: text-based stub file /System/Library/Frameworks//ForceFeedback.framework/ForceFeedback.tbd and library file /System/Library/Frameworks//ForceFeedback.framework/ForceFeedback are out of sync. Falling back to library file for linking.
ld: warning: text-based stub file /System/Library/Frameworks//CoreVideo.framework/CoreVideo.tbd and library file /System/Library/Frameworks//CoreVideo.framework/CoreVideo are out of sync. Falling back to library file for linking.
ld: warning: text-based stub file /System/Library/Frameworks//Cocoa.framework/Cocoa.tbd and library file /System/Library/Frameworks//Cocoa.framework/Cocoa are out of sync. Falling back to library file for linking.
ld: warning: text-based stub file /System/Library/Frameworks//IOKit.framework/IOKit.tbd and library file /System/Library/Frameworks//IOKit.framework/IOKit are out of sync. Falling back to library file for linking.
ld: warning: text-based stub file /System/Library/Frameworks//QuartzCore.framework/QuartzCore.tbd and library file /System/Library/Frameworks//QuartzCore.framework/QuartzCore are out of sync. Falling back to library file for linking.
ld: warning: text-based stub file /System/Library/Frameworks//Metal.framework/Metal.tbd and library file /System/Library/Frameworks//Metal.framework/Metal are out of sync. Falling back to library file for linking.
ld: warning: text-based stub file /System/Library/Frameworks//Security.framework/Security.tbd and library file /System/Library/Frameworks//Security.framework/Security are out of sync. Falling back to library file for linking.
ld: warning: text-based stub file /System/Library/Frameworks//OpenAL.framework/OpenAL.tbd and library file /System/Library/Frameworks//OpenAL.framework/OpenAL are out of sync. Falling back to library file for linking.
ld: warning: text-based stub file /System/Library/Frameworks//AppKit.framework/Versions/C/AppKit.tbd and library file /System/Library/Frameworks//AppKit.framework/Versions/C/AppKit are out of sync. Falling back to library file for linking.
ld: warning: text-based stub file /System/Library/Frameworks//CoreData.framework/Versions/A/CoreData.tbd and library file /System/Library/Frameworks//CoreData.framework/Versions/A/CoreData are out of sync. Falling back to library file for linking.
ld: warning: text-based stub file /System/Library/Frameworks//ApplicationServices.framework/Versions/A/ApplicationServices.tbd and library file /System/Library/Frameworks//ApplicationServices.framework/Versions/A/ApplicationServices are out of sync. Falling back to library file for linking.
ld: warning: text-based stub file /System/Library/Frameworks/Carbon.framework/Versions/A/Frameworks/CommonPanels.framework/Versions/A/CommonPanels.tbd and library file /System/Library/Frameworks/Carbon.framework/Versions/A/Frameworks/CommonPanels.framework/Versions/A/CommonPanels are out of sync. Falling back to library file for linking.
ld: warning: text-based stub file /System/Library/Frameworks/Carbon.framework/Versions/A/Frameworks/HIToolbox.framework/Versions/A/HIToolbox.tbd and library file /System/Library/Frameworks/Carbon.framework/Versions/A/Frameworks/HIToolbox.framework/Versions/A/HIToolbox are out of sync. Falling back to library file for linking.
ld: warning: text-based stub file /System/Library/Frameworks/Carbon.framework/Versions/A/Frameworks/Help.framework/Versions/A/Help.tbd and library file /System/Library/Frameworks/Carbon.framework/Versions/A/Frameworks/Help.framework/Versions/A/Help are out of sync. Falling back to library file for linking.
ld: warning: text-based stub file /System/Library/Frameworks/Carbon.framework/Versions/A/Frameworks/ImageCapture.framework/Versions/A/ImageCapture.tbd and library file /System/Library/Frameworks/Carbon.framework/Versions/A/Frameworks/ImageCapture.framework/Versions/A/ImageCapture are out of sync. Falling back to library file for linking.
ld: warning: text-based stub file /System/Library/Frameworks/Carbon.framework/Versions/A/Frameworks/Ink.framework/Versions/A/Ink.tbd and library file /System/Library/Frameworks/Carbon.framework/Versions/A/Frameworks/Ink.framework/Versions/A/Ink are out of sync. Falling back to library file for linking.
ld: warning: text-based stub file /System/Library/Frameworks/Carbon.framework/Versions/A/Frameworks/OpenScripting.framework/Versions/A/OpenScripting.tbd and library file /System/Library/Frameworks/Carbon.framework/Versions/A/Frameworks/OpenScripting.framework/Versions/A/OpenScripting are out of sync. Falling back to library file for linking.
ld: warning: text-based stub file /System/Library/Frameworks/Carbon.framework/Versions/A/Frameworks/Print.framework/Versions/A/Print.tbd and library file /System/Library/Frameworks/Carbon.framework/Versions/A/Frameworks/Print.framework/Versions/A/Print are out of sync. Falling back to library file for linking.
ld: warning: text-based stub file /System/Library/Frameworks/Carbon.framework/Versions/A/Frameworks/SecurityHI.framework/Versions/A/SecurityHI.tbd and library file /System/Library/Frameworks/Carbon.framework/Versions/A/Frameworks/SecurityHI.framework/Versions/A/SecurityHI are out of sync. Falling back to library file for linking.
ld: warning: text-based stub file /System/Library/Frameworks/Carbon.framework/Versions/A/Frameworks/SpeechRecognition.framework/Versions/A/SpeechRecognition.tbd and library file /System/Library/Frameworks/Carbon.framework/Versions/A/Frameworks/SpeechRecognition.framework/Versions/A/SpeechRecognition are out of sync. Falling back to library file for linking.
ld: warning: text-based stub file /System/Library/Frameworks//CoreImage.framework/Versions/A/CoreImage.tbd and library file /System/Library/Frameworks//CoreImage.framework/Versions/A/CoreImage are out of sync. Falling back to library file for linking.
ld: warning: text-based stub file /System/Library/Frameworks//CoreGraphics.framework/Versions/A/CoreGraphics.tbd and library file /System/Library/Frameworks//CoreGraphics.framework/Versions/A/CoreGraphics are out of sync. Falling back to library file for linking.
ld: warning: text-based stub file /System/Library/Frameworks//CoreText.framework/Versions/A/CoreText.tbd and library file /System/Library/Frameworks//CoreText.framework/Versions/A/CoreText are out of sync. Falling back to library file for linking.
ld: warning: text-based stub file /System/Library/Frameworks//ImageIO.framework/Versions/A/ImageIO.tbd and library file /System/Library/Frameworks//ImageIO.framework/Versions/A/ImageIO are out of sync. Falling back to library file for linking.
ld: warning: text-based stub file /System/Library/Frameworks//ColorSync.framework/Versions/A/ColorSync.tbd and library file /System/Library/Frameworks//ColorSync.framework/Versions/A/ColorSync are out of sync. Falling back to library file for linking.
ld: warning: text-based stub file /System/Library/Frameworks/ApplicationServices.framework/Versions/A/Frameworks/ATS.framework/Versions/A/ATS.tbd and library file /System/Library/Frameworks/ApplicationServices.framework/Versions/A/Frameworks/ATS.framework/Versions/A/ATS are out of sync. Falling back to library file for linking.
ld: warning: text-based stub file /System/Library/Frameworks/ApplicationServices.framework/Versions/A/Frameworks/ColorSyncLegacy.framework/Versions/A/ColorSyncLegacy.tbd and library file /System/Library/Frameworks/ApplicationServices.framework/Versions/A/Frameworks/ColorSyncLegacy.framework/Versions/A/ColorSyncLegacy are out of sync. Falling back to library file for linking.
ld: warning: text-based stub file /System/Library/Frameworks//CoreServices.framework/Versions/A/CoreServices.tbd and library file /System/Library/Frameworks//CoreServices.framework/Versions/A/CoreServices are out of sync. Falling back to library file for linking.
ld: warning: text-based stub file /System/Library/Frameworks/ApplicationServices.framework/Versions/A/Frameworks/HIServices.framework/Versions/A/HIServices.tbd and library file /System/Library/Frameworks/ApplicationServices.framework/Versions/A/Frameworks/HIServices.framework/Versions/A/HIServices are out of sync. Falling back to library file for linking.
ld: warning: text-based stub file /System/Library/Frameworks/ApplicationServices.framework/Versions/A/Frameworks/LangAnalysis.framework/Versions/A/LangAnalysis.tbd and library file /System/Library/Frameworks/ApplicationServices.framework/Versions/A/Frameworks/LangAnalysis.framework/Versions/A/LangAnalysis are out of sync. Falling back to library file for linking.
ld: warning: text-based stub file /System/Library/Frameworks/ApplicationServices.framework/Versions/A/Frameworks/PrintCore.framework/Versions/A/PrintCore.tbd and library file /System/Library/Frameworks/ApplicationServices.framework/Versions/A/Frameworks/PrintCore.framework/Versions/A/PrintCore are out of sync. Falling back to library file for linking.
ld: warning: text-based stub file /System/Library/Frameworks/ApplicationServices.framework/Versions/A/Frameworks/QD.framework/Versions/A/QD.tbd and library file /System/Library/Frameworks/ApplicationServices.framework/Versions/A/Frameworks/QD.framework/Versions/A/QD are out of sync. Falling back to library file for linking.
ld: warning: text-based stub file /System/Library/Frameworks/ApplicationServices.framework/Versions/A/Frameworks/SpeechSynthesis.framework/Versions/A/SpeechSynthesis.tbd and library file /System/Library/Frameworks/ApplicationServices.framework/Versions/A/Frameworks/SpeechSynthesis.framework/Versions/A/SpeechSynthesis are out of sync. Falling back to library file for linking.
ld: warning: text-based stub file /System/Library/PrivateFrameworks/UIFoundation.framework/Versions/A/UIFoundation.tbd and library file /System/Library/PrivateFrameworks/UIFoundation.framework/Versions/A/UIFoundation are out of sync. Falling back to library file for linking.
ld: warning: text-based stub file /System/Library/Frameworks//Foundation.framework/Versions/C/Foundation.tbd and library file /System/Library/Frameworks//Foundation.framework/Versions/C/Foundation are out of sync. Falling back to library file for linking.
ld: warning: text-based stub file /System/Library/Frameworks//CFNetwork.framework/Versions/A/CFNetwork.tbd and library file /System/Library/Frameworks//CFNetwork.framework/Versions/A/CFNetwork are out of sync. Falling back to library file for linking.
ld: warning: text-based stub file /System/Library/Frameworks/CoreServices.framework/Versions/A/Frameworks/FSEvents.framework/Versions/A/FSEvents.tbd and library file /System/Library/Frameworks/CoreServices.framework/Versions/A/Frameworks/FSEvents.framework/Versions/A/FSEvents are out of sync. Falling back to library file for linking.
ld: warning: text-based stub file /System/Library/Frameworks/CoreServices.framework/Versions/A/Frameworks/CarbonCore.framework/Versions/A/CarbonCore.tbd and library file /System/Library/Frameworks/CoreServices.framework/Versions/A/Frameworks/CarbonCore.framework/Versions/A/CarbonCore are out of sync. Falling back to library file for linking.
ld: warning: text-based stub file /System/Library/Frameworks/CoreServices.framework/Versions/A/Frameworks/Metadata.framework/Versions/A/Metadata.tbd and library file /System/Library/Frameworks/CoreServices.framework/Versions/A/Frameworks/Metadata.framework/Versions/A/Metadata are out of sync. Falling back to library file for linking.
ld: warning: text-based stub file /System/Library/Frameworks/CoreServices.framework/Versions/A/Frameworks/OSServices.framework/Versions/A/OSServices.tbd and library file /System/Library/Frameworks/CoreServices.framework/Versions/A/Frameworks/OSServices.framework/Versions/A/OSServices are out of sync. Falling back to library file for linking.
ld: warning: text-based stub file /System/Library/Frameworks/CoreServices.framework/Versions/A/Frameworks/SearchKit.framework/Versions/A/SearchKit.tbd and library file /System/Library/Frameworks/CoreServices.framework/Versions/A/Frameworks/SearchKit.framework/Versions/A/SearchKit are out of sync. Falling back to library file for linking.
ld: warning: text-based stub file /System/Library/Frameworks//CoreFoundation.framework/Versions/A/CoreFoundation.tbd and library file /System/Library/Frameworks//CoreFoundation.framework/Versions/A/CoreFoundation are out of sync. Falling back to library file for linking.
ld: warning: text-based stub file /System/Library/Frameworks/CoreServices.framework/Versions/A/Frameworks/AE.framework/Versions/A/AE.tbd and library file /System/Library/Frameworks/CoreServices.framework/Versions/A/Frameworks/AE.framework/Versions/A/AE are out of sync. Falling back to library file for linking.
ld: warning: text-based stub file /System/Library/Frameworks/CoreServices.framework/Versions/A/Frameworks/LaunchServices.framework/Versions/A/LaunchServices.tbd and library file /System/Library/Frameworks/CoreServices.framework/Versions/A/Frameworks/LaunchServices.framework/Versions/A/LaunchServices are out of sync. Falling back to library file for linking.
ld: warning: text-based stub file /System/Library/Frameworks/CoreServices.framework/Versions/A/Frameworks/DictionaryServices.framework/Versions/A/DictionaryServices.tbd and library file /System/Library/Frameworks/CoreServices.framework/Versions/A/Frameworks/DictionaryServices.framework/Versions/A/DictionaryServices are out of sync. Falling back to library file for linking.
ld: warning: text-based stub file /System/Library/Frameworks/CoreServices.framework/Versions/A/Frameworks/SharedFileList.framework/Versions/A/SharedFileList.tbd and library file /System/Library/Frameworks/CoreServices.framework/Versions/A/Frameworks/SharedFileList.framework/Versions/A/SharedFileList are out of sync. Falling back to library file for linking.
ld: warning: object file (../../../libraries/osx/fmt/lib/libfmt.a(format.cc.o)) was built for newer OSX version (10.13) than being linked (10.12)
ld: warning: text-based stub file /System/Library/Frameworks//CoreFoundation.framework/CoreFoundation.tbd and library file /System/Library/Frameworks//CoreFoundation.framework/CoreFoundation are out of sync. Falling back to library file for linking.
builderr-release-macos.txt
/Applications/Xcode.app/Contents/Developer/Toolchains/XcodeDefault.xctoolchain/usr/bin/ranlib: file: ../../../binaries/system/libsimulation2.a(precompiled.o) has no symbols
/Applications/Xcode.app/Contents/Developer/Toolchains/XcodeDefault.xctoolchain/usr/bin/ranlib: file: ../../../binaries/system/libgraphics.a(precompiled.o) has no symbols
/Applications/Xcode.app/Contents/Developer/Toolchains/XcodeDefault.xctoolchain/usr/bin/ranlib: file: ../../../binaries/system/liblowlevel.a(dbghelp.o) has no symbols
/Applications/Xcode.app/Contents/Developer/Toolchains/XcodeDefault.xctoolchain/usr/bin/ranlib: file: ../../../binaries/system/liblowlevel.a(file_stats.o) has no symbols
/Applications/Xcode.app/Contents/Developer/Toolchains/XcodeDefault.xctoolchain/usr/bin/ranlib: file: ../../../binaries/system/liblowlevel.a(vfs_path.o) has no symbols
/Applications/Xcode.app/Contents/Developer/Toolchains/XcodeDefault.xctoolchain/usr/bin/ranlib: file: ../../../binaries/system/liblowlevel.a(gfx.o) has no symbols
ld: warning: text-based stub file /System/Library/Frameworks//CoreAudio.framework/CoreAudio.tbd and library file /System/Library/Frameworks//CoreAudio.framework/CoreAudio are out of sync. Falling back to library file for linking.
ld: warning: text-based stub file /System/Library/Frameworks//AudioToolbox.framework/AudioToolbox.tbd and library file /System/Library/Frameworks//AudioToolbox.framework/AudioToolbox are out of sync. Falling back to library file for linking.
ld: warning: text-based stub file /System/Library/Frameworks//ForceFeedback.framework/ForceFeedback.tbd and library file /System/Library/Frameworks//ForceFeedback.framework/ForceFeedback are out of sync. Falling back to library file for linking.
ld: warning: text-based stub file /System/Library/Frameworks//CoreVideo.framework/CoreVideo.tbd and library file /System/Library/Frameworks//CoreVideo.framework/CoreVideo are out of sync. Falling back to library file for linking.
ld: warning: text-based stub file /System/Library/Frameworks//Cocoa.framework/Cocoa.tbd and library file /System/Library/Frameworks//Cocoa.framework/Cocoa are out of sync. Falling back to library file for linking.
ld: warning: text-based stub file /System/Library/Frameworks//IOKit.framework/IOKit.tbd and library file /System/Library/Frameworks//IOKit.framework/IOKit are out of sync. Falling back to library file for linking.
ld: warning: text-based stub file /System/Library/Frameworks//QuartzCore.framework/QuartzCore.tbd and library file /System/Library/Frameworks//QuartzCore.framework/QuartzCore are out of sync. Falling back to library file for linking.
ld: warning: text-based stub file /System/Library/Frameworks//Metal.framework/Metal.tbd and library file /System/Library/Frameworks//Metal.framework/Metal are out of sync. Falling back to library file for linking.
ld: warning: text-based stub file /System/Library/Frameworks//Security.framework/Security.tbd and library file /System/Library/Frameworks//Security.framework/Security are out of sync. Falling back to library file for linking.
ld: warning: text-based stub file /System/Library/Frameworks//OpenAL.framework/OpenAL.tbd and library file /System/Library/Frameworks//OpenAL.framework/OpenAL are out of sync. Falling back to library file for linking.
ld: warning: text-based stub file /System/Library/Frameworks//ApplicationServices.framework/ApplicationServices.tbd and library file /System/Library/Frameworks//ApplicationServices.framework/ApplicationServices are out of sync. Falling back to library file for linking.
ld: warning: text-based stub file /System/Library/Frameworks//Cocoa.framework/Cocoa.tbd and library file /System/Library/Frameworks//Cocoa.framework/Cocoa are out of sync. Falling back to library file for linking.
ld: warning: text-based stub file /System/Library/Frameworks//CoreFoundation.framework/CoreFoundation.tbd and library file /System/Library/Frameworks//CoreFoundation.framework/CoreFoundation are out of sync. Falling back to library file for linking.
ld: warning: text-based stub file /System/Library/Frameworks//AppKit.framework/Versions/C/AppKit.tbd and library file /System/Library/Frameworks//AppKit.framework/Versions/C/AppKit are out of sync. Falling back to library file for linking.
ld: warning: text-based stub file /System/Library/Frameworks//CoreData.framework/Versions/A/CoreData.tbd and library file /System/Library/Frameworks//CoreData.framework/Versions/A/CoreData are out of sync. Falling back to library file for linking.
ld: warning: text-based stub file /System/Library/Frameworks/Carbon.framework/Versions/A/Frameworks/CommonPanels.framework/Versions/A/CommonPanels.tbd and library file /System/Library/Frameworks/Carbon.framework/Versions/A/Frameworks/CommonPanels.framework/Versions/A/CommonPanels are out of sync. Falling back to library file for linking.
ld: warning: text-based stub file /System/Library/Frameworks/Carbon.framework/Versions/A/Frameworks/HIToolbox.framework/Versions/A/HIToolbox.tbd and library file /System/Library/Frameworks/Carbon.framework/Versions/A/Frameworks/HIToolbox.framework/Versions/A/HIToolbox are out of sync. Falling back to library file for linking.
ld: warning: text-based stub file /System/Library/Frameworks/Carbon.framework/Versions/A/Frameworks/Help.framework/Versions/A/Help.tbd and library file /System/Library/Frameworks/Carbon.framework/Versions/A/Frameworks/Help.framework/Versions/A/Help are out of sync. Falling back to library file for linking.
ld: warning: text-based stub file /System/Library/Frameworks/Carbon.framework/Versions/A/Frameworks/ImageCapture.framework/Versions/A/ImageCapture.tbd and library file /System/Library/Frameworks/Carbon.framework/Versions/A/Frameworks/ImageCapture.framework/Versions/A/ImageCapture are out of sync. Falling back to library file for linking.
ld: warning: text-based stub file /System/Library/Frameworks/Carbon.framework/Versions/A/Frameworks/Ink.framework/Versions/A/Ink.tbd and library file /System/Library/Frameworks/Carbon.framework/Versions/A/Frameworks/Ink.framework/Versions/A/Ink are out of sync. Falling back to library file for linking.
ld: warning: text-based stub file /System/Library/Frameworks/Carbon.framework/Versions/A/Frameworks/OpenScripting.framework/Versions/A/OpenScripting.tbd and library file /System/Library/Frameworks/Carbon.framework/Versions/A/Frameworks/OpenScripting.framework/Versions/A/OpenScripting are out of sync. Falling back to library file for linking.
ld: warning: text-based stub file /System/Library/Frameworks/Carbon.framework/Versions/A/Frameworks/Print.framework/Versions/A/Print.tbd and library file /System/Library/Frameworks/Carbon.framework/Versions/A/Frameworks/Print.framework/Versions/A/Print are out of sync. Falling back to library file for linking.
ld: warning: text-based stub file /System/Library/Frameworks/Carbon.framework/Versions/A/Frameworks/SecurityHI.framework/Versions/A/SecurityHI.tbd and library file /System/Library/Frameworks/Carbon.framework/Versions/A/Frameworks/SecurityHI.framework/Versions/A/SecurityHI are out of sync. Falling back to library file for linking.
ld: warning: text-based stub file /System/Library/Frameworks/Carbon.framework/Versions/A/Frameworks/SpeechRecognition.framework/Versions/A/SpeechRecognition.tbd and library file /System/Library/Frameworks/Carbon.framework/Versions/A/Frameworks/SpeechRecognition.framework/Versions/A/SpeechRecognition are out of sync. Falling back to library file for linking.
ld: warning: text-based stub file /System/Library/Frameworks//CoreImage.framework/Versions/A/CoreImage.tbd and library file /System/Library/Frameworks//CoreImage.framework/Versions/A/CoreImage are out of sync. Falling back to library file for linking.
ld: warning: text-based stub file /System/Library/Frameworks//CoreGraphics.framework/Versions/A/CoreGraphics.tbd and library file /System/Library/Frameworks//CoreGraphics.framework/Versions/A/CoreGraphics are out of sync. Falling back to library file for linking.
ld: warning: text-based stub file /System/Library/Frameworks//CoreText.framework/Versions/A/CoreText.tbd and library file /System/Library/Frameworks//CoreText.framework/Versions/A/CoreText are out of sync. Falling back to library file for linking.
ld: warning: text-based stub file /System/Library/Frameworks//ImageIO.framework/Versions/A/ImageIO.tbd and library file /System/Library/Frameworks//ImageIO.framework/Versions/A/ImageIO are out of sync. Falling back to library file for linking.
ld: warning: text-based stub file /System/Library/Frameworks//ColorSync.framework/Versions/A/ColorSync.tbd and library file /System/Library/Frameworks//ColorSync.framework/Versions/A/ColorSync are out of sync. Falling back to library file for linking.
ld: warning: text-based stub file /System/Library/Frameworks/ApplicationServices.framework/Versions/A/Frameworks/ATS.framework/Versions/A/ATS.tbd and library file /System/Library/Frameworks/ApplicationServices.framework/Versions/A/Frameworks/ATS.framework/Versions/A/ATS are out of sync. Falling back to library file for linking.
ld: warning: text-based stub file /System/Library/Frameworks/ApplicationServices.framework/Versions/A/Frameworks/ColorSyncLegacy.framework/Versions/A/ColorSyncLegacy.tbd and library file /System/Library/Frameworks/ApplicationServices.framework/Versions/A/Frameworks/ColorSyncLegacy.framework/Versions/A/ColorSyncLegacy are out of sync. Falling back to library file for linking.
ld: warning: text-based stub file /System/Library/Frameworks//CoreServices.framework/Versions/A/CoreServices.tbd and library file /System/Library/Frameworks//CoreServices.framework/Versions/A/CoreServices are out of sync. Falling back to library file for linking.
ld: warning: text-based stub file /System/Library/Frameworks/ApplicationServices.framework/Versions/A/Frameworks/HIServices.framework/Versions/A/HIServices.tbd and library file /System/Library/Frameworks/ApplicationServices.framework/Versions/A/Frameworks/HIServices.framework/Versions/A/HIServices are out of sync. Falling back to library file for linking.
ld: warning: text-based stub file /System/Library/Frameworks/ApplicationServices.framework/Versions/A/Frameworks/LangAnalysis.framework/Versions/A/LangAnalysis.tbd and library file /System/Library/Frameworks/ApplicationServices.framework/Versions/A/Frameworks/LangAnalysis.framework/Versions/A/LangAnalysis are out of sync. Falling back to library file for linking.
ld: warning: text-based stub file /System/Library/Frameworks/ApplicationServices.framework/Versions/A/Frameworks/PrintCore.framework/Versions/A/PrintCore.tbd and library file /System/Library/Frameworks/ApplicationServices.framework/Versions/A/Frameworks/PrintCore.framework/Versions/A/PrintCore are out of sync. Falling back to library file for linking.
ld: warning: text-based stub file /System/Library/Frameworks/ApplicationServices.framework/Versions/A/Frameworks/QD.framework/Versions/A/QD.tbd and library file /System/Library/Frameworks/ApplicationServices.framework/Versions/A/Frameworks/QD.framework/Versions/A/QD are out of sync. Falling back to library file for linking.
ld: warning: text-based stub file /System/Library/Frameworks/ApplicationServices.framework/Versions/A/Frameworks/SpeechSynthesis.framework/Versions/A/SpeechSynthesis.tbd and library file /System/Library/Frameworks/ApplicationServices.framework/Versions/A/Frameworks/SpeechSynthesis.framework/Versions/A/SpeechSynthesis are out of sync. Falling back to library file for linking.
ld: warning: text-based stub file /System/Library/Frameworks//CFNetwork.framework/Versions/A/CFNetwork.tbd and library file /System/Library/Frameworks//CFNetwork.framework/Versions/A/CFNetwork are out of sync. Falling back to library file for linking.
ld: warning: text-based stub file /System/Library/Frameworks/CoreServices.framework/Versions/A/Frameworks/FSEvents.framework/Versions/A/FSEvents.tbd and library file /System/Library/Frameworks/CoreServices.framework/Versions/A/Frameworks/FSEvents.framework/Versions/A/FSEvents are out of sync. Falling back to library file for linking.
ld: warning: text-based stub file /System/Library/Frameworks/CoreServices.framework/Versions/A/Frameworks/CarbonCore.framework/Versions/A/CarbonCore.tbd and library file /System/Library/Frameworks/CoreServices.framework/Versions/A/Frameworks/CarbonCore.framework/Versions/A/CarbonCore are out of sync. Falling back to library file for linking.
ld: warning: text-based stub file /System/Library/Frameworks/CoreServices.framework/Versions/A/Frameworks/Metadata.framework/Versions/A/Metadata.tbd and library file /System/Library/Frameworks/CoreServices.framework/Versions/A/Frameworks/Metadata.framework/Versions/A/Metadata are out of sync. Falling back to library file for linking.
ld: warning: text-based stub file /System/Library/Frameworks/CoreServices.framework/Versions/A/Frameworks/OSServices.framework/Versions/A/OSServices.tbd and library file /System/Library/Frameworks/CoreServices.framework/Versions/A/Frameworks/OSServices.framework/Versions/A/OSServices are out of sync. Falling back to library file for linking.
ld: warning: text-based stub file /System/Library/Frameworks/CoreServices.framework/Versions/A/Frameworks/SearchKit.framework/Versions/A/SearchKit.tbd and library file /System/Library/Frameworks/CoreServices.framework/Versions/A/Frameworks/SearchKit.framework/Versions/A/SearchKit are out of sync. Falling back to library file for linking.
ld: warning: text-based stub file /System/Library/Frameworks/CoreServices.framework/Versions/A/Frameworks/AE.framework/Versions/A/AE.tbd and library file /System/Library/Frameworks/CoreServices.framework/Versions/A/Frameworks/AE.framework/Versions/A/AE are out of sync. Falling back to library file for linking.
ld: warning: text-based stub file /System/Library/Frameworks/CoreServices.framework/Versions/A/Frameworks/LaunchServices.framework/Versions/A/LaunchServices.tbd and library file /System/Library/Frameworks/CoreServices.framework/Versions/A/Frameworks/LaunchServices.framework/Versions/A/LaunchServices are out of sync. Falling back to library file for linking.
ld: warning: text-based stub file /System/Library/Frameworks/CoreServices.framework/Versions/A/Frameworks/DictionaryServices.framework/Versions/A/DictionaryServices.tbd and library file /System/Library/Frameworks/CoreServices.framework/Versions/A/Frameworks/DictionaryServices.framework/Versions/A/DictionaryServices are out of sync. Falling back to library file for linking.
ld: warning: text-based stub file /System/Library/Frameworks/CoreServices.framework/Versions/A/Frameworks/SharedFileList.framework/Versions/A/SharedFileList.tbd and library file /System/Library/Frameworks/CoreServices.framework/Versions/A/Frameworks/SharedFileList.framework/Versions/A/SharedFileList are out of sync. Falling back to library file for linking.
ld: warning: text-based stub file /System/Library/PrivateFrameworks/UIFoundation.framework/Versions/A/UIFoundation.tbd and library file /System/Library/PrivateFrameworks/UIFoundation.framework/Versions/A/UIFoundation are out of sync. Falling back to library file for linking.
ld: warning: text-based stub file /System/Library/Frameworks//Foundation.framework/Versions/C/Foundation.tbd and library file /System/Library/Frameworks//Foundation.framework/Versions/C/Foundation are out of sync. Falling back to library file for linking.
ld: warning: object file (../../../libraries/osx/fmt/lib/libfmt.a(format.cc.o)) was built for newer OSX version (10.13) than being linked (10.12)
ld: warning: text-based stub file /System/Library/Frameworks//CoreFoundation.framework/CoreFoundation.tbd and library file /System/Library/Frameworks//CoreFoundation.framework/CoreFoundation are out of sync. Falling back to library file for linking.
ld: warning: text-based stub file /System/Library/Frameworks//CoreAudio.framework/CoreAudio.tbd and library file /System/Library/Frameworks//CoreAudio.framework/CoreAudio are out of sync. Falling back to library file for linking.
ld: warning: text-based stub file /System/Library/Frameworks//AudioToolbox.framework/AudioToolbox.tbd and library file /System/Library/Frameworks//AudioToolbox.framework/AudioToolbox are out of sync. Falling back to library file for linking.
ld: warning: text-based stub file /System/Library/Frameworks//ForceFeedback.framework/ForceFeedback.tbd and library file /System/Library/Frameworks//ForceFeedback.framework/ForceFeedback are out of sync. Falling back to library file for linking.
ld: warning: text-based stub file /System/Library/Frameworks//CoreVideo.framework/CoreVideo.tbd and library file /System/Library/Frameworks//CoreVideo.framework/CoreVideo are out of sync. Falling back to library file for linking.
ld: warning: text-based stub file /System/Library/Frameworks//Cocoa.framework/Cocoa.tbd and library file /System/Library/Frameworks//Cocoa.framework/Cocoa are out of sync. Falling back to library file for linking.
ld: warning: text-based stub file /System/Library/Frameworks//IOKit.framework/IOKit.tbd and library file /System/Library/Frameworks//IOKit.framework/IOKit are out of sync. Falling back to library file for linking.
ld: warning: text-based stub file /System/Library/Frameworks//QuartzCore.framework/QuartzCore.tbd and library file /System/Library/Frameworks//QuartzCore.framework/QuartzCore are out of sync. Falling back to library file for linking.
ld: warning: text-based stub file /System/Library/Frameworks//Metal.framework/Metal.tbd and library file /System/Library/Frameworks//Metal.framework/Metal are out of sync. Falling back to library file for linking.
ld: warning: text-based stub file /System/Library/Frameworks//Security.framework/Security.tbd and library file /System/Library/Frameworks//Security.framework/Security are out of sync. Falling back to library file for linking.
ld: warning: text-based stub file /System/Library/Frameworks//OpenAL.framework/OpenAL.tbd and library file /System/Library/Frameworks//OpenAL.framework/OpenAL are out of sync. Falling back to library file for linking.
ld: warning: text-based stub file /System/Library/Frameworks//AppKit.framework/Versions/C/AppKit.tbd and library file /System/Library/Frameworks//AppKit.framework/Versions/C/AppKit are out of sync. Falling back to library file for linking.
ld: warning: text-based stub file /System/Library/Frameworks//CoreData.framework/Versions/A/CoreData.tbd and library file /System/Library/Frameworks//CoreData.framework/Versions/A/CoreData are out of sync. Falling back to library file for linking.
ld: warning: text-based stub file /System/Library/Frameworks//ApplicationServices.framework/Versions/A/ApplicationServices.tbd and library file /System/Library/Frameworks//ApplicationServices.framework/Versions/A/ApplicationServices are out of sync. Falling back to library file for linking.
ld: warning: text-based stub file /System/Library/Frameworks/Carbon.framework/Versions/A/Frameworks/CommonPanels.framework/Versions/A/CommonPanels.tbd and library file /System/Library/Frameworks/Carbon.framework/Versions/A/Frameworks/CommonPanels.framework/Versions/A/CommonPanels are out of sync. Falling back to library file for linking.
ld: warning: text-based stub file /System/Library/Frameworks/Carbon.framework/Versions/A/Frameworks/HIToolbox.framework/Versions/A/HIToolbox.tbd and library file /System/Library/Frameworks/Carbon.framework/Versions/A/Frameworks/HIToolbox.framework/Versions/A/HIToolbox are out of sync. Falling back to library file for linking.
ld: warning: text-based stub file /System/Library/Frameworks/Carbon.framework/Versions/A/Frameworks/Help.framework/Versions/A/Help.tbd and library file /System/Library/Frameworks/Carbon.framework/Versions/A/Frameworks/Help.framework/Versions/A/Help are out of sync. Falling back to library file for linking.
ld: warning: text-based stub file /System/Library/Frameworks/Carbon.framework/Versions/A/Frameworks/ImageCapture.framework/Versions/A/ImageCapture.tbd and library file /System/Library/Frameworks/Carbon.framework/Versions/A/Frameworks/ImageCapture.framework/Versions/A/ImageCapture are out of sync. Falling back to library file for linking.
ld: warning: text-based stub file /System/Library/Frameworks/Carbon.framework/Versions/A/Frameworks/Ink.framework/Versions/A/Ink.tbd and library file /System/Library/Frameworks/Carbon.framework/Versions/A/Frameworks/Ink.framework/Versions/A/Ink are out of sync. Falling back to library file for linking.
ld: warning: text-based stub file /System/Library/Frameworks/Carbon.framework/Versions/A/Frameworks/OpenScripting.framework/Versions/A/OpenScripting.tbd and library file /System/Library/Frameworks/Carbon.framework/Versions/A/Frameworks/OpenScripting.framework/Versions/A/OpenScripting are out of sync. Falling back to library file for linking.
ld: warning: text-based stub file /System/Library/Frameworks/Carbon.framework/Versions/A/Frameworks/Print.framework/Versions/A/Print.tbd and library file /System/Library/Frameworks/Carbon.framework/Versions/A/Frameworks/Print.framework/Versions/A/Print are out of sync. Falling back to library file for linking.
ld: warning: text-based stub file /System/Library/Frameworks/Carbon.framework/Versions/A/Frameworks/SecurityHI.framework/Versions/A/SecurityHI.tbd and library file /System/Library/Frameworks/Carbon.framework/Versions/A/Frameworks/SecurityHI.framework/Versions/A/SecurityHI are out of sync. Falling back to library file for linking.
ld: warning: text-based stub file /System/Library/Frameworks/Carbon.framework/Versions/A/Frameworks/SpeechRecognition.framework/Versions/A/SpeechRecognition.tbd and library file /System/Library/Frameworks/Carbon.framework/Versions/A/Frameworks/SpeechRecognition.framework/Versions/A/SpeechRecognition are out of sync. Falling back to library file for linking.
ld: warning: text-based stub file /System/Library/Frameworks//CoreImage.framework/Versions/A/CoreImage.tbd and library file /System/Library/Frameworks//CoreImage.framework/Versions/A/CoreImage are out of sync. Falling back to library file for linking.
ld: warning: text-based stub file /System/Library/PrivateFrameworks/UIFoundation.framework/Versions/A/UIFoundation.tbd and library file /System/Library/PrivateFrameworks/UIFoundation.framework/Versions/A/UIFoundation are out of sync. Falling back to library file for linking.
ld: warning: text-based stub file /System/Library/Frameworks//Foundation.framework/Versions/C/Foundation.tbd and library file /System/Library/Frameworks//Foundation.framework/Versions/C/Foundation are out of sync. Falling back to library file for linking.
ld: warning: text-based stub file /System/Library/Frameworks//CoreGraphics.framework/Versions/A/CoreGraphics.tbd and library file /System/Library/Frameworks//CoreGraphics.framework/Versions/A/CoreGraphics are out of sync. Falling back to library file for linking.
ld: warning: text-based stub file /System/Library/Frameworks//CoreText.framework/Versions/A/CoreText.tbd and library file /System/Library/Frameworks//CoreText.framework/Versions/A/CoreText are out of sync. Falling back to library file for linking.
ld: warning: text-based stub file /System/Library/Frameworks//ImageIO.framework/Versions/A/ImageIO.tbd and library file /System/Library/Frameworks//ImageIO.framework/Versions/A/ImageIO are out of sync. Falling back to library file for linking.
ld: warning: text-based stub file /System/Library/Frameworks//ColorSync.framework/Versions/A/ColorSync.tbd and library file /System/Library/Frameworks//ColorSync.framework/Versions/A/ColorSync are out of sync. Falling back to library file for linking.
ld: warning: text-based stub file /System/Library/Frameworks/ApplicationServices.framework/Versions/A/Frameworks/ATS.framework/Versions/A/ATS.tbd and library file /System/Library/Frameworks/ApplicationServices.framework/Versions/A/Frameworks/ATS.framework/Versions/A/ATS are out of sync. Falling back to library file for linking.
ld: warning: text-based stub file /System/Library/Frameworks/ApplicationServices.framework/Versions/A/Frameworks/ColorSyncLegacy.framework/Versions/A/ColorSyncLegacy.tbd and library file /System/Library/Frameworks/ApplicationServices.framework/Versions/A/Frameworks/ColorSyncLegacy.framework/Versions/A/ColorSyncLegacy are out of sync. Falling back to library file for linking.
ld: warning: text-based stub file /System/Library/Frameworks//CoreServices.framework/Versions/A/CoreServices.tbd and library file /System/Library/Frameworks//CoreServices.framework/Versions/A/CoreServices are out of sync. Falling back to library file for linking.
ld: warning: text-based stub file /System/Library/Frameworks/ApplicationServices.framework/Versions/A/Frameworks/HIServices.framework/Versions/A/HIServices.tbd and library file /System/Library/Frameworks/ApplicationServices.framework/Versions/A/Frameworks/HIServices.framework/Versions/A/HIServices are out of sync. Falling back to library file for linking.
ld: warning: text-based stub file /System/Library/Frameworks/ApplicationServices.framework/Versions/A/Frameworks/LangAnalysis.framework/Versions/A/LangAnalysis.tbd and library file /System/Library/Frameworks/ApplicationServices.framework/Versions/A/Frameworks/LangAnalysis.framework/Versions/A/LangAnalysis are out of sync. Falling back to library file for linking.
ld: warning: text-based stub file /System/Library/Frameworks/ApplicationServices.framework/Versions/A/Frameworks/PrintCore.framework/Versions/A/PrintCore.tbd and library file /System/Library/Frameworks/ApplicationServices.framework/Versions/A/Frameworks/PrintCore.framework/Versions/A/PrintCore are out of sync. Falling back to library file for linking.
ld: warning: text-based stub file /System/Library/Frameworks/ApplicationServices.framework/Versions/A/Frameworks/QD.framework/Versions/A/QD.tbd and library file /System/Library/Frameworks/ApplicationServices.framework/Versions/A/Frameworks/QD.framework/Versions/A/QD are out of sync. Falling back to library file for linking.
ld: warning: text-based stub file /System/Library/Frameworks/ApplicationServices.framework/Versions/A/Frameworks/SpeechSynthesis.framework/Versions/A/SpeechSynthesis.tbd and library file /System/Library/Frameworks/ApplicationServices.framework/Versions/A/Frameworks/SpeechSynthesis.framework/Versions/A/SpeechSynthesis are out of sync. Falling back to library file for linking.
ld: warning: text-based stub file /System/Library/Frameworks//CFNetwork.framework/Versions/A/CFNetwork.tbd and library file /System/Library/Frameworks//CFNetwork.framework/Versions/A/CFNetwork are out of sync. Falling back to library file for linking.
ld: warning: text-based stub file /System/Library/Frameworks/CoreServices.framework/Versions/A/Frameworks/FSEvents.framework/Versions/A/FSEvents.tbd and library file /System/Library/Frameworks/CoreServices.framework/Versions/A/Frameworks/FSEvents.framework/Versions/A/FSEvents are out of sync. Falling back to library file for linking.
ld: warning: text-based stub file /System/Library/Frameworks/CoreServices.framework/Versions/A/Frameworks/CarbonCore.framework/Versions/A/CarbonCore.tbd and library file /System/Library/Frameworks/CoreServices.framework/Versions/A/Frameworks/CarbonCore.framework/Versions/A/CarbonCore are out of sync. Falling back to library file for linking.
ld: warning: text-based stub file /System/Library/Frameworks/CoreServices.framework/Versions/A/Frameworks/Metadata.framework/Versions/A/Metadata.tbd and library file /System/Library/Frameworks/CoreServices.framework/Versions/A/Frameworks/Metadata.framework/Versions/A/Metadata are out of sync. Falling back to library file for linking.
ld: warning: text-based stub file /System/Library/Frameworks/CoreServices.framework/Versions/A/Frameworks/OSServices.framework/Versions/A/OSServices.tbd and library file /System/Library/Frameworks/CoreServices.framework/Versions/A/Frameworks/OSServices.framework/Versions/A/OSServices are out of sync. Falling back to library file for linking.
ld: warning: text-based stub file /System/Library/Frameworks/CoreServices.framework/Versions/A/Frameworks/SearchKit.framework/Versions/A/SearchKit.tbd and library file /System/Library/Frameworks/CoreServices.framework/Versions/A/Frameworks/SearchKit.framework/Versions/A/SearchKit are out of sync. Falling back to library file for linking.
ld: warning: text-based stub file /System/Library/Frameworks//CoreFoundation.framework/Versions/A/CoreFoundation.tbd and library file /System/Library/Frameworks//CoreFoundation.framework/Versions/A/CoreFoundation are out of sync. Falling back to library file for linking.
ld: warning: text-based stub file /System/Library/Frameworks/CoreServices.framework/Versions/A/Frameworks/AE.framework/Versions/A/AE.tbd and library file /System/Library/Frameworks/CoreServices.framework/Versions/A/Frameworks/AE.framework/Versions/A/AE are out of sync. Falling back to library file for linking.
ld: warning: text-based stub file /System/Library/Frameworks/CoreServices.framework/Versions/A/Frameworks/LaunchServices.framework/Versions/A/LaunchServices.tbd and library file /System/Library/Frameworks/CoreServices.framework/Versions/A/Frameworks/LaunchServices.framework/Versions/A/LaunchServices are out of sync. Falling back to library file for linking.
ld: warning: text-based stub file /System/Library/Frameworks/CoreServices.framework/Versions/A/Frameworks/DictionaryServices.framework/Versions/A/DictionaryServices.tbd and library file /System/Library/Frameworks/CoreServices.framework/Versions/A/Frameworks/DictionaryServices.framework/Versions/A/DictionaryServices are out of sync. Falling back to library file for linking.
ld: warning: text-based stub file /System/Library/Frameworks/CoreServices.framework/Versions/A/Frameworks/SharedFileList.framework/Versions/A/SharedFileList.tbd and library file /System/Library/Frameworks/CoreServices.framework/Versions/A/Frameworks/SharedFileList.framework/Versions/A/SharedFileList are out of sync. Falling back to library file for linking.
ld: warning: object file (../../../libraries/osx/fmt/lib/libfmt.a(format.cc.o)) was built for newer OSX version (10.13) than being linked (10.12)
ld: warning: text-based stub file /System/Library/Frameworks//CoreFoundation.framework/CoreFoundation.tbd and library file /System/Library/Frameworks//CoreFoundation.framework/CoreFoundation are out of sync. Falling back to library file for linking.

Link to build: https://jenkins.wildfiregames.com/job/macos-differential/6268/display/redirect

Stan updated the Trac tickets for this revision.Jul 24 2022, 11:53 PM
Langbart added a subscriber: Langbart.EditedJul 24 2022, 11:54 PM

make a dangling symlink ...

❯ ln -s ~/ThisFolderDoesNotExist ~/Library/Application\ Support/0ad/mods/ThisFolderDoesNotExist
❯ ls -la ~/Library/Application\ Support/0ad/mods/ | grep ThisFolderDoesNotExist
lrwxr-xr-x   1 paria  staff     35 Jul 24 22:55 ThisFolderDoesNotExist -> /Users/paria/ThisFolderDoesNotExist

start 0ad

Before applying the patch I would get the following output

Terminal output
❯ pyrogenesis
TIMER| InitVfs: 2.513 ms
FILES| Main log written to '/Users/paria/Library/Application Support/0ad/logs/mainlog.html'
FILES| Interesting log written to '/Users/paria/Library/Application Support/0ad/logs/interestinglog.html'
TIMER| CONFIG_Init: 6.691 ms
Function call failed: return value was -110301 (Error during IO)
Location: file_system.cpp:123 (GetDirectoryEntries)

Call stack:

(error while dumping stack: Function not supported)
errno = 2 (Error during IO)
OS error = ?


(C)ontinue, (S)uppress, (B)reak, Launch (D)ebugger, or (E)xit?
e
Redirecting call to abort() to mozalloc_abort

zsh: segmentation fault  pyrogenesis

After applying the patch the game window gives me the desired warning.


notes
  • Not ' dangling' symlinks work correctly, too.
  • I have also tested using multiple dangling symlinks and that also works correctly. I get several messages.
  • The original problem is reproducible between the last GIT version and Alpha XXIII - Ken Wood [rP21946], from Alpha XXII Venustas [rP19922] backwards the game no longer crashes on a dangling symlink.
vladislavbelov added inline comments.
source/lib/file/file_system.cpp
115

What's about Windows?

122

If we skip such files doesn't it make sense to also ignore files without enough rights to read EACCES (maybe other errors too)?

124–125

Might be GetDirectoryEntries called before g_Logger initialization?

Before applying the patch I would get the following output

Terminal output
❯ pyrogenesis
TIMER| InitVfs: 2.513 ms
FILES| Main log written to '/Users/paria/Library/Application Support/0ad/logs/mainlog.html'
FILES| Interesting log written to '/Users/paria/Library/Application Support/0ad/logs/interestinglog.html'
TIMER| CONFIG_Init: 6.691 ms
Function call failed: return value was -110301 (Error during IO)
Location: file_system.cpp:123 (GetDirectoryEntries)

Call stack:

(error while dumping stack: Function not supported)
errno = 2 (Error during IO)
OS error = ?

I also got an "Error during IO" but why? it is not EIO?

  • Not ' dangling' symlinks work correctly, too.

Tanks for testing i forgot that case.

phosit added inline comments.Jul 25 2022, 12:06 PM
source/lib/file/file_system.cpp
122

This is the wrong place to handle EACCES. Eighter none set errno or all set errno.
But ENAMETOOLONG might be worth handling.

124–125

we can't be shure about that until we remove g_Logger and pass it as argument.

Stan added a comment.EditedJul 25 2022, 3:49 PM

On Windows in C:\Users\{username}\Documents\My Games\0ad\mods

Command
mklink /D test_mod "C:\Thisdoesnotexist"
Assertion Dialog
Function call failed: return value was -110301 (Error during IO)
Location: wfilesystem.cpp:137 (wopendir)

Call stack:

wopendir (wfilesystem.cpp:137)
    path = 0x010AF650 -> 
        path = (unsupported basic_string<wchar_t,char_traits<wchar_t> >)
        separator = [8] { 92 ('\'), 0, 58880, 1435, 35052, 220, 96 ('`'), 0 }

    d = (unavailable - internal error)

    s = 
        m_lastError = 3 (0x00000003)

    status = (unavailable)
    status = (unavailable)
    status = 432581963522506751 (0x0600D700FFFFFFFF)
    searchPath = 
        path = (unsupported basic_string<wchar_t,char_traits<wchar_t> >)
        separator = 92 ('\')


DirectoryExists (file_system.cpp:40)
    path = 0x010AF650 (see above)
    dir = (unavailable)

VFS::Mount (vfs.cpp:60)
    this = 0x07CFDDA8 -> 
        (IVFS)
        m_trace = (shared_ptr<ITrace>)
        m_rootDirectory = 
            m_files = (unsupported map<Path,VfsFile >)
            m_subdirectories = (unsupported map<Path,VfsDirectory >)
            m_realDirectory = (shared_ptr<RealDirectory>)
            m_shouldPopulate = 0 (0x00000000)


    mountPoint = 0x010AF61C -> 
        path = (unsupported basic_string<wchar_t,char_traits<wchar_t> >)
        separator = [8] { 47 ('/'), 30631, 0, 0, 0, 0, 96 ('`'), 0 }

    path = (unavailable)
    path = 0x010AF650 (see above)
    flags = 4 (0x00000004)
    priority = 0 (0x00000000)
    lock = (lock_guard<mutex>)
    realDirectory = (shared_ptr<RealDirectory>)
    directory = 0x00AE070B -> 
        m_files = (unsupported map<Path,VfsFile >)
        m_subdirectories = (unsupported map<Path,VfsDirectory >)
        m_realDirectory = (shared_ptr<RealDirectory>)
        m_shouldPopulate = 2557017962 (0x9868FF6A)

    status_ = (unavailable - internal error)

    status_ = (unavailable - internal error)

    status_ = (unavailable - internal error)


`anonymous namespace'::LoadModJSON (mod.cpp:62)
    vfs = 0x010AF7F4 -> (shared_ptr<IVFS>)
    vfs = 0x010AF7F4 (see above)
    modsPath = 
        path = (unsupported basic_string<wchar_t,char_traits<wchar_t> >)
        separator = 92 ('\')

    mod = 
        path = (unsupported basic_string<wchar_t,char_traits<wchar_t> >)
        separator = 47 ('/')

    text = 0x010AF730 -> (unsupported basic_string<char,char_traits<char> >)
    modjson = (basic_ifstream<char,char_traits<char> >)
    modinfo = 
        m_Buffer = (shared_ptr<unsigned char>)
        m_BufferSize = 15 (0x0000000F)

    out_mod_json = (basic_ofstream<char,char_traits<char> >)
    buffer = (basic_stringstream<char,char_traits<char> >)

`anonymous namespace'::ParseModJSON (mod.cpp:100)
    rq = 0x011C1240 -> 
        cx = 0x011C07D0 -> (JSContext)
        glob = 
            { (js::WrappedPtrOperations<JSObject *,JS::Handle<JSObject *> >) }
            ptr = 0x07D7B588 -> 0x011C1240 (see above)

        nativeScope = 
            { (js::WrappedPtrOperations<JSObject *,JS::Handle<JSObject *> >) }
            ptr = 0x00000000

        m_ScriptInterface = 0x07D7B4C0 -> 
            m_CmptPrivate = 
                pScriptInterface = 0x011C1240 (see above)
                pCBData = 0x00000000

            m = (unique_ptr<ScriptInterface_impl,default_delete<ScriptInterface_impl> >)
            m_CustomObjectTypes = (unsupported map<basic_string<char,char_traits<char> >,ScriptInterface::CustomType >)

        m_FormerRealm = 0x00000000

    rq = (unavailable)
    vfs = (unavailable)
    modsPath = (unavailable)
    mod = (unavailable)
    data = (unavailable)
    data = (unavailable)
    text = (unsupported basic_string<char,char_traits<char> >)
    json = 
        { 
                (js::WrappedPtrOperations<JS::Value,JS::Rooted<JS::Value> >)
 }
        stack = 0x00000000
        prev = 0x00000060
        ptr = 
            asBits_ = 75144868069900288 (0x010AF7DC00000000)



Mod::UpdateAvailableMods (mod.cpp:269)
    this = 0x00EDE158 -> 
        m_EnabledMods = (unsupported vector<CStr8 >)
        m_IncompatibleMods = (unsupported vector<CStr8 >)
        m_AvailableMods = (unsupported vector<Mod::ModData >)

    scriptInterface = 0x07CFCC38 -> 
        m_CmptPrivate = 
            pScriptInterface = 0x00750070 -> 
                m_CmptPrivate = 
                    pScriptInterface = (unavailable - internal error)

                    pCBData = (unavailable - internal error)


                m = (unique_ptr<ScriptInterface_impl,default_delete<ScriptInterface_impl> >)
                m_CustomObjectTypes = (unsupported map<basic_string<char,char_traits<char> >,ScriptInterface::CustomType >)

            pCBData = 0x006C0062

        m = (unique_ptr<ScriptInterface_impl,default_delete<ScriptInterface_impl> >)
        m_CustomObjectTypes = (unsupported map<basic_string<char,char_traits<char> >,ScriptInterface::CustomType >)

    scriptInterface = 0x010AFAB0 -> 
        m_CmptPrivate = 
            pScriptInterface = 0x010AFAB0 (see above)
            pCBData = 0x00000010

        m = (unique_ptr<ScriptInterface_impl,default_delete<ScriptInterface_impl> >)
        m_CustomObjectTypes = (unsupported map<basic_string<char,char_traits<char> >,ScriptInterface::CustomType >)

    modDirsUser = (unsupported vector<Path >)
    rq = 
        cx = 0x07BE69D0 -> (JSContext)
        glob = 
            { (js::WrappedPtrOperations<JSObject *,JS::Handle<JSObject *> >) }
            ptr = 0x07CFF020 -> 0x0B64A040 -> (JSObject)

        nativeScope = 
            { (js::WrappedPtrOperations<JSObject *,JS::Handle<JSObject *> >) }
            ptr = 0x07CFF034 -> 0x0B500008 -> (JSObject)

        m_ScriptInterface = 0x010AFAB0 (see above)
        m_FormerRealm = 0x00000000

    modPath = 
        path = (unsupported basic_string<wchar_t,char_traits<wchar_t> >)
        separator = 92 ('\')

    profile2__ = 
        m_Name = 0x00E5DBFC -> "UpdateAvailableMods"

    paths = 
        m_root = 
            path = (unsupported basic_string<wchar_t,char_traits<wchar_t> >)
            separator = 92 ('\')

        m_rdata = 
            path = (unsupported basic_string<wchar_t,char_traits<wchar_t> >)
            separator = 92 ('\')

        m_gameData = 
            path = (unsupported basic_string<wchar_t,char_traits<wchar_t> >)
            separator = 92 ('\')

        m_userData = 
            path = (unsupported basic_string<wchar_t,char_traits<wchar_t> >)
            separator = 92 ('\')

        m_config = 
            path = (unsupported basic_string<wchar_t,char_traits<wchar_t> >)
            separator = 92 ('\')

        m_cache = 
            path = (unsupported basic_string<wchar_t,char_traits<wchar_t> >)
            separator = 92 ('\')

        m_logs = 
            path = (unsupported basic_string<wchar_t,char_traits<wchar_t> >)
            separator = 92 ('\')


    modUserPath = 
        path = (unsupported basic_string<wchar_t,char_traits<wchar_t> >)
        separator = 92 ('\')

    vfs = (shared_ptr<IVFS>)
    modDirs = (unsupported vector<Path >)
    iter = (unsupported _Vector_iterator<_Vector_val<_Simple_types<Path> > >)
    data = 
        m_Pathname = { (unsupported basic_string<char,char_traits<char> >) }
        m_Name = { (unsupported basic_string<char,char_traits<char> >) }
        m_Version = { (unsupported basic_string<char,char_traits<char> >) }
        m_Dependencies = (unsupported vector<CStr8 >)
        m_IgnoreInCompatibilityChecks = (unavailable - internal error)

        m_Text = { (unsupported basic_string<char,char_traits<char> >) }

    iter = (unavailable)
    data = 
        m_Pathname = { (unsupported basic_string<char,char_traits<char> >) }
        m_Name = { (unsupported basic_string<char,char_traits<char> >) }
        m_Version = { (unsupported basic_string<char,char_traits<char> >) }
        m_Dependencies = (unsupported vector<CStr8 >)
        m_IgnoreInCompatibilityChecks = false
        m_Text = { (unsupported basic_string<char,char_traits<char> >) }


Init (gamesetup.cpp:657)
    args = (unavailable)
    args = 0x010AFD04 -> 
        m_Args = (unsupported vector<pair<CStr8,CStr8> >)
        m_Arg0 = 
            path = (unsupported basic_string<wchar_t,char_traits<wchar_t> >)
            separator = [8] { 92 ('\'), 245, 0, 0, 0, 0, 0, 0 }

        m_ArgsWithoutName = (unsupported vector<CStr8 >)

    flags = 8 (0x00000008)
    profilerHTTPEnable = (bool)0x09
    mods = (unsupported vector<CStr8 >)
    modInterface = 
        m_CmptPrivate = 
            pScriptInterface = 0x010AFAB0 (see above)
            pCBData = 0x00000010

        m = (unique_ptr<ScriptInterface_impl,default_delete<ScriptInterface_impl> >)
        m_CustomObjectTypes = (unsupported map<basic_string<char,char_traits<char> >,ScriptInterface::CustomType >)

    modsStr = { (unsupported basic_string<char,char_traits<char> >) }
    sim = 
        m = 0x00000000

    f = (basic_ofstream<char,char_traits<char> >)

RunGameOrAtlas (main.cpp:643)
    argc = 1 (0x00000001)
    argv = 0x033C0008 -> 0x033C0028 -> "C:\Dev\0ad-git\binaries\system\pyrogenesis.exe"
    isNonVisualReplay = false
    flags = 8 (0x00000008)
    args = 
        m_Args = (unsupported vector<pair<CStr8,CStr8> >)
        m_Arg0 = 
            path = (unsupported basic_string<wchar_t,char_traits<wchar_t> >)
            separator = 92 ('\')

        m_ArgsWithoutName = (unsupported vector<CStr8 >)

    isNonVisual = false
    isUsingRLInterface = false
    scriptEngine = 
        (Singleton<ScriptEngine>)
        m_Contexts = (unsupported list<JSContext const * >)

    res = 1e-07 (0x3E7AD7F29ABCAF48)
    isVisualReplay = (unavailable - internal error)

    modsToInstall = (unsupported vector<Path >)
    replayFile = 
        path = (unsupported basic_string<wchar_t,char_traits<wchar_t> >)
        separator = 47 ('/')

    <begin>$L0 = 0x00000000
    <end>$L0 = 0x00000000
    modPath = 
        path = (unsupported basic_string<wchar_t,char_traits<wchar_t> >)
        separator = 203

    paths = 
        m_root = 
            path = (unsupported basic_string<wchar_t,char_traits<wchar_t> >)
            separator = 13954

        m_rdata = 
            path = (unsupported basic_string<wchar_t,char_traits<wchar_t> >)
            separator = 2033

        m_gameData = 
            path = (unsupported basic_string<wchar_t,char_traits<wchar_t> >)
            separator = 64572

        m_userData = 
            path = (unsupported basic_string<wchar_t,char_traits<wchar_t> >)
            separator = 64572

        m_config = 
            path = (unsupported basic_string<wchar_t,char_traits<wchar_t> >)
            separator = 0

        m_cache = 
            path = (unsupported basic_string<wchar_t,char_traits<wchar_t> >)
            separator = 11816

        m_logs = 
            path = (unsupported basic_string<wchar_t,char_traits<wchar_t> >)
            separator = 2033


    replay = 
        m_Stream = 0x00000000

    builder = 
        m_VFS = (shared_ptr<IVFS>)
        m_Files = (unsupported vector<Path >)
        m_TempDir = 
            path = (unsupported basic_string<wchar_t,char_traits<wchar_t> >)
            separator = 64960

        m_NumBaseMods = 84639776 (0x050B8020)

    paths = 
        m_root = 
            path = (unsupported basic_string<wchar_t,char_traits<wchar_t> >)
            separator = 13954

        m_rdata = 
            path = (unsupported basic_string<wchar_t,char_traits<wchar_t> >)
            separator = 2033

        m_gameData = 
            path = (unsupported basic_string<wchar_t,char_traits<wchar_t> >)
            separator = 64572

        m_userData = 
            path = (unsupported basic_string<wchar_t,char_traits<wchar_t> >)
            separator = 64572

        m_config = 
            path = (unsupported basic_string<wchar_t,char_traits<wchar_t> >)
            separator = 0

        m_cache = 
            path = (unsupported basic_string<wchar_t,char_traits<wchar_t> >)
            separator = 11816

        m_logs = 
            path = (unsupported basic_string<wchar_t,char_traits<wchar_t> >)
            separator = 2033


    mod = 
        path = (unsupported basic_string<wchar_t,char_traits<wchar_t> >)
        separator = 20816

    zip = 
        path = (unsupported basic_string<wchar_t,char_traits<wchar_t> >)
        separator = 65072

    mods = (unsupported vector<CStr8 >)
    i = (unavailable - internal error)

    installedMods = (unsupported vector<CStr8 >)
    paths = 
        m_root = 
            path = (unsupported basic_string<wchar_t,char_traits<wchar_t> >)
            separator = 13954

        m_rdata = 
            path = (unsupported basic_string<wchar_t,char_traits<wchar_t> >)
            separator = 2033

        m_gameData = 
            path = (unsupported basic_string<wchar_t,char_traits<wchar_t> >)
            separator = 64572

        m_userData = 
            path = (unsupported basic_string<wchar_t,char_traits<wchar_t> >)
            separator = 64572

        m_config = 
            path = (unsupported basic_string<wchar_t,char_traits<wchar_t> >)
            separator = 0

        m_cache = 
            path = (unsupported basic_string<wchar_t,char_traits<wchar_t> >)
            separator = 11816

        m_logs = 
            path = (unsupported basic_string<wchar_t,char_traits<wchar_t> >)
            separator = 2033


    installer = 
        m_VFS = (shared_ptr<IVFS>)
        m_ModsDir = 
            path = (unsupported basic_string<wchar_t,char_traits<wchar_t> >)
            separator = 0

        m_TempDir = 
            path = (unsupported basic_string<wchar_t,char_traits<wchar_t> >)
            separator = 15888

        m_CacheDir = 
            path = (unsupported basic_string<wchar_t,char_traits<wchar_t> >)
            separator = 2

        m_InstalledMods = (unsupported vector<CStr8 >)

    modInterface = 
        m_CmptPrivate = 
            pScriptInterface = 0x006E6F69 -> 
                m_CmptPrivate = 
                    pScriptInterface = (unavailable - internal error)

                    pCBData = (unavailable - internal error)


                m = (unique_ptr<ScriptInterface_impl,default_delete<ScriptInterface_impl> >)
                m_CustomObjectTypes = (unsupported map<basic_string<char,char_traits<char> >,ScriptInterface::CustomType >)

            pCBData = 0x050B8032

        m = (unique_ptr<ScriptInterface_impl,default_delete<ScriptInterface_impl> >)
        m_CustomObjectTypes = (unsupported map<basic_string<char,char_traits<char> >,ScriptInterface::CustomType >)

    <end>$L1 = (unavailable - internal error)

    <begin>$L1 = (unavailable - internal error)

    result = (unavailable - internal error)

    g_Profiler2 = 
        m_Initialised = (unavailable - internal error)

        m_FrameNumber = (unavailable - internal error)

        m_MgContext = (unavailable - internal error)

        m_GPU = (unavailable - internal error)

        m_Mutex = (mutex)
        m_Threads = (unsupported vector<unique_ptr<CProfiler2::ThreadStorage,default_delete<CProfiler2::ThreadStorage> > >)

    g_Shutdown = (unavailable - internal error)


SDL_main (main.cpp:743)
    argc = 1 (0x00000001)
    argv = 0x033C0008 (see above)

main_getcmdline (sdl_windows_main.c:74)
    argvw = (unavailable)
    argc = (unavailable)

__scrt_common_main_seh (exe_common.inl:288)
    has_cctor = false
    main_result = (unavailable - internal error)

    tls_init_callback = (unavailable - internal error)

    is_nested = false
    tls_dtor_callback = (unavailable - internal error)

    main_result = 0 (0x00000000)
    __scrt_current_native_startup_state = (unavailable - internal error)


CallStartupWithinTryBlock (wseh.cpp:365)
    ret = (unavailable)
    ret = 0 (0x00000000)

RtlGetFullPathName_UEx (:0)

RtlGetFullPathName_UEx (:0)


errno = 2 (Error during IO)
OS error = 3 (Le chemin d’accès spécifié est introuvable.)

https://github.com/0ad/0ad/blob/master/source/lib/sysdep/os/win/wposix/wfilesystem.cpp#L137

Why do WARN_ON_ERROR and WARN_RETURN abort the program? shouldn't they warn as the name says?

Stan added a comment.EditedJul 25 2022, 9:14 PM

They trigger Assertion popups. You're free to ignore suppress them. Except in Atlas where it goes south and crashes the entire game.

defc0n added a subscriber: defc0n.Jul 25 2022, 9:15 PM
phosit updated this revision to Diff 20666.Jul 25 2022, 9:42 PM

Handle error also on windows (hopefully i can't test ^^)

I think the duplicate is ok until we have std::filesystem

Successful build - Chance fights ever on the side of the prudent.

builderr-debug-macos.txt
/Applications/Xcode.app/Contents/Developer/Toolchains/XcodeDefault.xctoolchain/usr/bin/ranlib: file: ../../../binaries/system/liblowlevel_dbg.a(dbghelp.o) has no symbols
/Applications/Xcode.app/Contents/Developer/Toolchains/XcodeDefault.xctoolchain/usr/bin/ranlib: file: ../../../binaries/system/liblowlevel_dbg.a(file_stats.o) has no symbols
/Applications/Xcode.app/Contents/Developer/Toolchains/XcodeDefault.xctoolchain/usr/bin/ranlib: file: ../../../binaries/system/liblowlevel_dbg.a(vfs_path.o) has no symbols
/Applications/Xcode.app/Contents/Developer/Toolchains/XcodeDefault.xctoolchain/usr/bin/ranlib: file: ../../../binaries/system/liblowlevel_dbg.a(gfx.o) has no symbols
ld: warning: text-based stub file /System/Library/Frameworks//CoreAudio.framework/CoreAudio.tbd and library file /System/Library/Frameworks//CoreAudio.framework/CoreAudio are out of sync. Falling back to library file for linking.
ld: warning: text-based stub file /System/Library/Frameworks//AudioToolbox.framework/AudioToolbox.tbd and library file /System/Library/Frameworks//AudioToolbox.framework/AudioToolbox are out of sync. Falling back to library file for linking.
ld: warning: text-based stub file /System/Library/Frameworks//ForceFeedback.framework/ForceFeedback.tbd and library file /System/Library/Frameworks//ForceFeedback.framework/ForceFeedback are out of sync. Falling back to library file for linking.
ld: warning: text-based stub file /System/Library/Frameworks//CoreVideo.framework/CoreVideo.tbd and library file /System/Library/Frameworks//CoreVideo.framework/CoreVideo are out of sync. Falling back to library file for linking.
ld: warning: text-based stub file /System/Library/Frameworks//Cocoa.framework/Cocoa.tbd and library file /System/Library/Frameworks//Cocoa.framework/Cocoa are out of sync. Falling back to library file for linking.
ld: warning: text-based stub file /System/Library/Frameworks//IOKit.framework/IOKit.tbd and library file /System/Library/Frameworks//IOKit.framework/IOKit are out of sync. Falling back to library file for linking.
ld: warning: text-based stub file /System/Library/Frameworks//QuartzCore.framework/QuartzCore.tbd and library file /System/Library/Frameworks//QuartzCore.framework/QuartzCore are out of sync. Falling back to library file for linking.
ld: warning: text-based stub file /System/Library/Frameworks//Metal.framework/Metal.tbd and library file /System/Library/Frameworks//Metal.framework/Metal are out of sync. Falling back to library file for linking.
ld: warning: text-based stub file /System/Library/Frameworks//Security.framework/Security.tbd and library file /System/Library/Frameworks//Security.framework/Security are out of sync. Falling back to library file for linking.
ld: warning: text-based stub file /System/Library/Frameworks//OpenAL.framework/OpenAL.tbd and library file /System/Library/Frameworks//OpenAL.framework/OpenAL are out of sync. Falling back to library file for linking.
ld: warning: text-based stub file /System/Library/Frameworks//ApplicationServices.framework/ApplicationServices.tbd and library file /System/Library/Frameworks//ApplicationServices.framework/ApplicationServices are out of sync. Falling back to library file for linking.
ld: warning: text-based stub file /System/Library/Frameworks//Cocoa.framework/Cocoa.tbd and library file /System/Library/Frameworks//Cocoa.framework/Cocoa are out of sync. Falling back to library file for linking.
ld: warning: text-based stub file /System/Library/Frameworks//CoreFoundation.framework/CoreFoundation.tbd and library file /System/Library/Frameworks//CoreFoundation.framework/CoreFoundation are out of sync. Falling back to library file for linking.
ld: warning: text-based stub file /System/Library/Frameworks//CoreGraphics.framework/Versions/A/CoreGraphics.tbd and library file /System/Library/Frameworks//CoreGraphics.framework/Versions/A/CoreGraphics are out of sync. Falling back to library file for linking.
ld: warning: text-based stub file /System/Library/Frameworks//CoreText.framework/Versions/A/CoreText.tbd and library file /System/Library/Frameworks//CoreText.framework/Versions/A/CoreText are out of sync. Falling back to library file for linking.
ld: warning: text-based stub file /System/Library/Frameworks//ImageIO.framework/Versions/A/ImageIO.tbd and library file /System/Library/Frameworks//ImageIO.framework/Versions/A/ImageIO are out of sync. Falling back to library file for linking.
ld: warning: text-based stub file /System/Library/Frameworks//ColorSync.framework/Versions/A/ColorSync.tbd and library file /System/Library/Frameworks//ColorSync.framework/Versions/A/ColorSync are out of sync. Falling back to library file for linking.
ld: warning: text-based stub file /System/Library/Frameworks/ApplicationServices.framework/Versions/A/Frameworks/ATS.framework/Versions/A/ATS.tbd and library file /System/Library/Frameworks/ApplicationServices.framework/Versions/A/Frameworks/ATS.framework/Versions/A/ATS are out of sync. Falling back to library file for linking.
ld: warning: text-based stub file /System/Library/Frameworks/ApplicationServices.framework/Versions/A/Frameworks/ColorSyncLegacy.framework/Versions/A/ColorSyncLegacy.tbd and library file /System/Library/Frameworks/ApplicationServices.framework/Versions/A/Frameworks/ColorSyncLegacy.framework/Versions/A/ColorSyncLegacy are out of sync. Falling back to library file for linking.
ld: warning: text-based stub file /System/Library/Frameworks//CoreServices.framework/Versions/A/CoreServices.tbd and library file /System/Library/Frameworks//CoreServices.framework/Versions/A/CoreServices are out of sync. Falling back to library file for linking.
ld: warning: text-based stub file /System/Library/Frameworks/ApplicationServices.framework/Versions/A/Frameworks/HIServices.framework/Versions/A/HIServices.tbd and library file /System/Library/Frameworks/ApplicationServices.framework/Versions/A/Frameworks/HIServices.framework/Versions/A/HIServices are out of sync. Falling back to library file for linking.
ld: warning: text-based stub file /System/Library/Frameworks/ApplicationServices.framework/Versions/A/Frameworks/LangAnalysis.framework/Versions/A/LangAnalysis.tbd and library file /System/Library/Frameworks/ApplicationServices.framework/Versions/A/Frameworks/LangAnalysis.framework/Versions/A/LangAnalysis are out of sync. Falling back to library file for linking.
ld: warning: text-based stub file /System/Library/Frameworks/ApplicationServices.framework/Versions/A/Frameworks/PrintCore.framework/Versions/A/PrintCore.tbd and library file /System/Library/Frameworks/ApplicationServices.framework/Versions/A/Frameworks/PrintCore.framework/Versions/A/PrintCore are out of sync. Falling back to library file for linking.
ld: warning: text-based stub file /System/Library/Frameworks/ApplicationServices.framework/Versions/A/Frameworks/QD.framework/Versions/A/QD.tbd and library file /System/Library/Frameworks/ApplicationServices.framework/Versions/A/Frameworks/QD.framework/Versions/A/QD are out of sync. Falling back to library file for linking.
ld: warning: text-based stub file /System/Library/Frameworks/ApplicationServices.framework/Versions/A/Frameworks/SpeechSynthesis.framework/Versions/A/SpeechSynthesis.tbd and library file /System/Library/Frameworks/ApplicationServices.framework/Versions/A/Frameworks/SpeechSynthesis.framework/Versions/A/SpeechSynthesis are out of sync. Falling back to library file for linking.
ld: warning: text-based stub file /System/Library/Frameworks//AppKit.framework/Versions/C/AppKit.tbd and library file /System/Library/Frameworks//AppKit.framework/Versions/C/AppKit are out of sync. Falling back to library file for linking.
ld: warning: text-based stub file /System/Library/Frameworks//CoreData.framework/Versions/A/CoreData.tbd and library file /System/Library/Frameworks//CoreData.framework/Versions/A/CoreData are out of sync. Falling back to library file for linking.
ld: warning: text-based stub file /System/Library/Frameworks/Carbon.framework/Versions/A/Frameworks/CommonPanels.framework/Versions/A/CommonPanels.tbd and library file /System/Library/Frameworks/Carbon.framework/Versions/A/Frameworks/CommonPanels.framework/Versions/A/CommonPanels are out of sync. Falling back to library file for linking.
ld: warning: text-based stub file /System/Library/Frameworks/Carbon.framework/Versions/A/Frameworks/HIToolbox.framework/Versions/A/HIToolbox.tbd and library file /System/Library/Frameworks/Carbon.framework/Versions/A/Frameworks/HIToolbox.framework/Versions/A/HIToolbox are out of sync. Falling back to library file for linking.
ld: warning: text-based stub file /System/Library/Frameworks/Carbon.framework/Versions/A/Frameworks/Help.framework/Versions/A/Help.tbd and library file /System/Library/Frameworks/Carbon.framework/Versions/A/Frameworks/Help.framework/Versions/A/Help are out of sync. Falling back to library file for linking.
ld: warning: text-based stub file /System/Library/Frameworks/Carbon.framework/Versions/A/Frameworks/ImageCapture.framework/Versions/A/ImageCapture.tbd and library file /System/Library/Frameworks/Carbon.framework/Versions/A/Frameworks/ImageCapture.framework/Versions/A/ImageCapture are out of sync. Falling back to library file for linking.
ld: warning: text-based stub file /System/Library/Frameworks/Carbon.framework/Versions/A/Frameworks/Ink.framework/Versions/A/Ink.tbd and library file /System/Library/Frameworks/Carbon.framework/Versions/A/Frameworks/Ink.framework/Versions/A/Ink are out of sync. Falling back to library file for linking.
ld: warning: text-based stub file /System/Library/Frameworks/Carbon.framework/Versions/A/Frameworks/OpenScripting.framework/Versions/A/OpenScripting.tbd and library file /System/Library/Frameworks/Carbon.framework/Versions/A/Frameworks/OpenScripting.framework/Versions/A/OpenScripting are out of sync. Falling back to library file for linking.
ld: warning: text-based stub file /System/Library/Frameworks/Carbon.framework/Versions/A/Frameworks/Print.framework/Versions/A/Print.tbd and library file /System/Library/Frameworks/Carbon.framework/Versions/A/Frameworks/Print.framework/Versions/A/Print are out of sync. Falling back to library file for linking.
ld: warning: text-based stub file /System/Library/Frameworks/Carbon.framework/Versions/A/Frameworks/SecurityHI.framework/Versions/A/SecurityHI.tbd and library file /System/Library/Frameworks/Carbon.framework/Versions/A/Frameworks/SecurityHI.framework/Versions/A/SecurityHI are out of sync. Falling back to library file for linking.
ld: warning: text-based stub file /System/Library/Frameworks/Carbon.framework/Versions/A/Frameworks/SpeechRecognition.framework/Versions/A/SpeechRecognition.tbd and library file /System/Library/Frameworks/Carbon.framework/Versions/A/Frameworks/SpeechRecognition.framework/Versions/A/SpeechRecognition are out of sync. Falling back to library file for linking.
ld: warning: text-based stub file /System/Library/Frameworks//CoreImage.framework/Versions/A/CoreImage.tbd and library file /System/Library/Frameworks//CoreImage.framework/Versions/A/CoreImage are out of sync. Falling back to library file for linking.
ld: warning: text-based stub file /System/Library/Frameworks//CFNetwork.framework/Versions/A/CFNetwork.tbd and library file /System/Library/Frameworks//CFNetwork.framework/Versions/A/CFNetwork are out of sync. Falling back to library file for linking.
ld: warning: text-based stub file /System/Library/Frameworks/CoreServices.framework/Versions/A/Frameworks/FSEvents.framework/Versions/A/FSEvents.tbd and library file /System/Library/Frameworks/CoreServices.framework/Versions/A/Frameworks/FSEvents.framework/Versions/A/FSEvents are out of sync. Falling back to library file for linking.
ld: warning: text-based stub file /System/Library/Frameworks/CoreServices.framework/Versions/A/Frameworks/CarbonCore.framework/Versions/A/CarbonCore.tbd and library file /System/Library/Frameworks/CoreServices.framework/Versions/A/Frameworks/CarbonCore.framework/Versions/A/CarbonCore are out of sync. Falling back to library file for linking.
ld: warning: text-based stub file /System/Library/Frameworks/CoreServices.framework/Versions/A/Frameworks/Metadata.framework/Versions/A/Metadata.tbd and library file /System/Library/Frameworks/CoreServices.framework/Versions/A/Frameworks/Metadata.framework/Versions/A/Metadata are out of sync. Falling back to library file for linking.
ld: warning: text-based stub file /System/Library/Frameworks/CoreServices.framework/Versions/A/Frameworks/OSServices.framework/Versions/A/OSServices.tbd and library file /System/Library/Frameworks/CoreServices.framework/Versions/A/Frameworks/OSServices.framework/Versions/A/OSServices are out of sync. Falling back to library file for linking.
ld: warning: text-based stub file /System/Library/Frameworks/CoreServices.framework/Versions/A/Frameworks/SearchKit.framework/Versions/A/SearchKit.tbd and library file /System/Library/Frameworks/CoreServices.framework/Versions/A/Frameworks/SearchKit.framework/Versions/A/SearchKit are out of sync. Falling back to library file for linking.
ld: warning: text-based stub file /System/Library/Frameworks/CoreServices.framework/Versions/A/Frameworks/AE.framework/Versions/A/AE.tbd and library file /System/Library/Frameworks/CoreServices.framework/Versions/A/Frameworks/AE.framework/Versions/A/AE are out of sync. Falling back to library file for linking.
ld: warning: text-based stub file /System/Library/Frameworks/CoreServices.framework/Versions/A/Frameworks/LaunchServices.framework/Versions/A/LaunchServices.tbd and library file /System/Library/Frameworks/CoreServices.framework/Versions/A/Frameworks/LaunchServices.framework/Versions/A/LaunchServices are out of sync. Falling back to library file for linking.
ld: warning: text-based stub file /System/Library/Frameworks/CoreServices.framework/Versions/A/Frameworks/DictionaryServices.framework/Versions/A/DictionaryServices.tbd and library file /System/Library/Frameworks/CoreServices.framework/Versions/A/Frameworks/DictionaryServices.framework/Versions/A/DictionaryServices are out of sync. Falling back to library file for linking.
ld: warning: text-based stub file /System/Library/Frameworks/CoreServices.framework/Versions/A/Frameworks/SharedFileList.framework/Versions/A/SharedFileList.tbd and library file /System/Library/Frameworks/CoreServices.framework/Versions/A/Frameworks/SharedFileList.framework/Versions/A/SharedFileList are out of sync. Falling back to library file for linking.
ld: warning: text-based stub file /System/Library/PrivateFrameworks/UIFoundation.framework/Versions/A/UIFoundation.tbd and library file /System/Library/PrivateFrameworks/UIFoundation.framework/Versions/A/UIFoundation are out of sync. Falling back to library file for linking.
ld: warning: text-based stub file /System/Library/Frameworks//Foundation.framework/Versions/C/Foundation.tbd and library file /System/Library/Frameworks//Foundation.framework/Versions/C/Foundation are out of sync. Falling back to library file for linking.
ld: warning: object file (../../../libraries/osx/fmt/lib/libfmt.a(format.cc.o)) was built for newer OSX version (10.13) than being linked (10.12)
ld: warning: text-based stub file /System/Library/Frameworks//CoreFoundation.framework/CoreFoundation.tbd and library file /System/Library/Frameworks//CoreFoundation.framework/CoreFoundation are out of sync. Falling back to library file for linking.
ld: warning: text-based stub file /System/Library/Frameworks//CoreAudio.framework/CoreAudio.tbd and library file /System/Library/Frameworks//CoreAudio.framework/CoreAudio are out of sync. Falling back to library file for linking.
ld: warning: text-based stub file /System/Library/Frameworks//AudioToolbox.framework/AudioToolbox.tbd and library file /System/Library/Frameworks//AudioToolbox.framework/AudioToolbox are out of sync. Falling back to library file for linking.
ld: warning: text-based stub file /System/Library/Frameworks//ForceFeedback.framework/ForceFeedback.tbd and library file /System/Library/Frameworks//ForceFeedback.framework/ForceFeedback are out of sync. Falling back to library file for linking.
ld: warning: text-based stub file /System/Library/Frameworks//CoreVideo.framework/CoreVideo.tbd and library file /System/Library/Frameworks//CoreVideo.framework/CoreVideo are out of sync. Falling back to library file for linking.
ld: warning: text-based stub file /System/Library/Frameworks//Cocoa.framework/Cocoa.tbd and library file /System/Library/Frameworks//Cocoa.framework/Cocoa are out of sync. Falling back to library file for linking.
ld: warning: text-based stub file /System/Library/Frameworks//IOKit.framework/IOKit.tbd and library file /System/Library/Frameworks//IOKit.framework/IOKit are out of sync. Falling back to library file for linking.
ld: warning: text-based stub file /System/Library/Frameworks//QuartzCore.framework/QuartzCore.tbd and library file /System/Library/Frameworks//QuartzCore.framework/QuartzCore are out of sync. Falling back to library file for linking.
ld: warning: text-based stub file /System/Library/Frameworks//Metal.framework/Metal.tbd and library file /System/Library/Frameworks//Metal.framework/Metal are out of sync. Falling back to library file for linking.
ld: warning: text-based stub file /System/Library/Frameworks//Security.framework/Security.tbd and library file /System/Library/Frameworks//Security.framework/Security are out of sync. Falling back to library file for linking.
ld: warning: text-based stub file /System/Library/Frameworks//OpenAL.framework/OpenAL.tbd and library file /System/Library/Frameworks//OpenAL.framework/OpenAL are out of sync. Falling back to library file for linking.
ld: warning: text-based stub file /System/Library/Frameworks//AppKit.framework/Versions/C/AppKit.tbd and library file /System/Library/Frameworks//AppKit.framework/Versions/C/AppKit are out of sync. Falling back to library file for linking.
ld: warning: text-based stub file /System/Library/Frameworks//CoreData.framework/Versions/A/CoreData.tbd and library file /System/Library/Frameworks//CoreData.framework/Versions/A/CoreData are out of sync. Falling back to library file for linking.
ld: warning: text-based stub file /System/Library/Frameworks//ApplicationServices.framework/Versions/A/ApplicationServices.tbd and library file /System/Library/Frameworks//ApplicationServices.framework/Versions/A/ApplicationServices are out of sync. Falling back to library file for linking.
ld: warning: text-based stub file /System/Library/Frameworks/Carbon.framework/Versions/A/Frameworks/CommonPanels.framework/Versions/A/CommonPanels.tbd and library file /System/Library/Frameworks/Carbon.framework/Versions/A/Frameworks/CommonPanels.framework/Versions/A/CommonPanels are out of sync. Falling back to library file for linking.
ld: warning: text-based stub file /System/Library/Frameworks/Carbon.framework/Versions/A/Frameworks/HIToolbox.framework/Versions/A/HIToolbox.tbd and library file /System/Library/Frameworks/Carbon.framework/Versions/A/Frameworks/HIToolbox.framework/Versions/A/HIToolbox are out of sync. Falling back to library file for linking.
ld: warning: text-based stub file /System/Library/Frameworks/Carbon.framework/Versions/A/Frameworks/Help.framework/Versions/A/Help.tbd and library file /System/Library/Frameworks/Carbon.framework/Versions/A/Frameworks/Help.framework/Versions/A/Help are out of sync. Falling back to library file for linking.
ld: warning: text-based stub file /System/Library/Frameworks/Carbon.framework/Versions/A/Frameworks/ImageCapture.framework/Versions/A/ImageCapture.tbd and library file /System/Library/Frameworks/Carbon.framework/Versions/A/Frameworks/ImageCapture.framework/Versions/A/ImageCapture are out of sync. Falling back to library file for linking.
ld: warning: text-based stub file /System/Library/Frameworks/Carbon.framework/Versions/A/Frameworks/Ink.framework/Versions/A/Ink.tbd and library file /System/Library/Frameworks/Carbon.framework/Versions/A/Frameworks/Ink.framework/Versions/A/Ink are out of sync. Falling back to library file for linking.
ld: warning: text-based stub file /System/Library/Frameworks/Carbon.framework/Versions/A/Frameworks/OpenScripting.framework/Versions/A/OpenScripting.tbd and library file /System/Library/Frameworks/Carbon.framework/Versions/A/Frameworks/OpenScripting.framework/Versions/A/OpenScripting are out of sync. Falling back to library file for linking.
ld: warning: text-based stub file /System/Library/Frameworks/Carbon.framework/Versions/A/Frameworks/Print.framework/Versions/A/Print.tbd and library file /System/Library/Frameworks/Carbon.framework/Versions/A/Frameworks/Print.framework/Versions/A/Print are out of sync. Falling back to library file for linking.
ld: warning: text-based stub file /System/Library/Frameworks/Carbon.framework/Versions/A/Frameworks/SecurityHI.framework/Versions/A/SecurityHI.tbd and library file /System/Library/Frameworks/Carbon.framework/Versions/A/Frameworks/SecurityHI.framework/Versions/A/SecurityHI are out of sync. Falling back to library file for linking.
ld: warning: text-based stub file /System/Library/Frameworks/Carbon.framework/Versions/A/Frameworks/SpeechRecognition.framework/Versions/A/SpeechRecognition.tbd and library file /System/Library/Frameworks/Carbon.framework/Versions/A/Frameworks/SpeechRecognition.framework/Versions/A/SpeechRecognition are out of sync. Falling back to library file for linking.
ld: warning: text-based stub file /System/Library/Frameworks//CoreImage.framework/Versions/A/CoreImage.tbd and library file /System/Library/Frameworks//CoreImage.framework/Versions/A/CoreImage are out of sync. Falling back to library file for linking.
ld: warning: text-based stub file /System/Library/PrivateFrameworks/UIFoundation.framework/Versions/A/UIFoundation.tbd and library file /System/Library/PrivateFrameworks/UIFoundation.framework/Versions/A/UIFoundation are out of sync. Falling back to library file for linking.
ld: warning: text-based stub file /System/Library/Frameworks//Foundation.framework/Versions/C/Foundation.tbd and library file /System/Library/Frameworks//Foundation.framework/Versions/C/Foundation are out of sync. Falling back to library file for linking.
ld: warning: text-based stub file /System/Library/Frameworks//CoreGraphics.framework/Versions/A/CoreGraphics.tbd and library file /System/Library/Frameworks//CoreGraphics.framework/Versions/A/CoreGraphics are out of sync. Falling back to library file for linking.
ld: warning: text-based stub file /System/Library/Frameworks//CoreText.framework/Versions/A/CoreText.tbd and library file /System/Library/Frameworks//CoreText.framework/Versions/A/CoreText are out of sync. Falling back to library file for linking.
ld: warning: text-based stub file /System/Library/Frameworks//ImageIO.framework/Versions/A/ImageIO.tbd and library file /System/Library/Frameworks//ImageIO.framework/Versions/A/ImageIO are out of sync. Falling back to library file for linking.
ld: warning: text-based stub file /System/Library/Frameworks//ColorSync.framework/Versions/A/ColorSync.tbd and library file /System/Library/Frameworks//ColorSync.framework/Versions/A/ColorSync are out of sync. Falling back to library file for linking.
ld: warning: text-based stub file /System/Library/Frameworks/ApplicationServices.framework/Versions/A/Frameworks/ATS.framework/Versions/A/ATS.tbd and library file /System/Library/Frameworks/ApplicationServices.framework/Versions/A/Frameworks/ATS.framework/Versions/A/ATS are out of sync. Falling back to library file for linking.
ld: warning: text-based stub file /System/Library/Frameworks/ApplicationServices.framework/Versions/A/Frameworks/ColorSyncLegacy.framework/Versions/A/ColorSyncLegacy.tbd and library file /System/Library/Frameworks/ApplicationServices.framework/Versions/A/Frameworks/ColorSyncLegacy.framework/Versions/A/ColorSyncLegacy are out of sync. Falling back to library file for linking.
ld: warning: text-based stub file /System/Library/Frameworks//CoreServices.framework/Versions/A/CoreServices.tbd and library file /System/Library/Frameworks//CoreServices.framework/Versions/A/CoreServices are out of sync. Falling back to library file for linking.
ld: warning: text-based stub file /System/Library/Frameworks/ApplicationServices.framework/Versions/A/Frameworks/HIServices.framework/Versions/A/HIServices.tbd and library file /System/Library/Frameworks/ApplicationServices.framework/Versions/A/Frameworks/HIServices.framework/Versions/A/HIServices are out of sync. Falling back to library file for linking.
ld: warning: text-based stub file /System/Library/Frameworks/ApplicationServices.framework/Versions/A/Frameworks/LangAnalysis.framework/Versions/A/LangAnalysis.tbd and library file /System/Library/Frameworks/ApplicationServices.framework/Versions/A/Frameworks/LangAnalysis.framework/Versions/A/LangAnalysis are out of sync. Falling back to library file for linking.
ld: warning: text-based stub file /System/Library/Frameworks/ApplicationServices.framework/Versions/A/Frameworks/PrintCore.framework/Versions/A/PrintCore.tbd and library file /System/Library/Frameworks/ApplicationServices.framework/Versions/A/Frameworks/PrintCore.framework/Versions/A/PrintCore are out of sync. Falling back to library file for linking.
ld: warning: text-based stub file /System/Library/Frameworks/ApplicationServices.framework/Versions/A/Frameworks/QD.framework/Versions/A/QD.tbd and library file /System/Library/Frameworks/ApplicationServices.framework/Versions/A/Frameworks/QD.framework/Versions/A/QD are out of sync. Falling back to library file for linking.
ld: warning: text-based stub file /System/Library/Frameworks/ApplicationServices.framework/Versions/A/Frameworks/SpeechSynthesis.framework/Versions/A/SpeechSynthesis.tbd and library file /System/Library/Frameworks/ApplicationServices.framework/Versions/A/Frameworks/SpeechSynthesis.framework/Versions/A/SpeechSynthesis are out of sync. Falling back to library file for linking.
ld: warning: text-based stub file /System/Library/Frameworks//CoreFoundation.framework/Versions/A/CoreFoundation.tbd and library file /System/Library/Frameworks//CoreFoundation.framework/Versions/A/CoreFoundation are out of sync. Falling back to library file for linking.
ld: warning: text-based stub file /System/Library/Frameworks//CFNetwork.framework/Versions/A/CFNetwork.tbd and library file /System/Library/Frameworks//CFNetwork.framework/Versions/A/CFNetwork are out of sync. Falling back to library file for linking.
ld: warning: text-based stub file /System/Library/Frameworks/CoreServices.framework/Versions/A/Frameworks/FSEvents.framework/Versions/A/FSEvents.tbd and library file /System/Library/Frameworks/CoreServices.framework/Versions/A/Frameworks/FSEvents.framework/Versions/A/FSEvents are out of sync. Falling back to library file for linking.
ld: warning: text-based stub file /System/Library/Frameworks/CoreServices.framework/Versions/A/Frameworks/CarbonCore.framework/Versions/A/CarbonCore.tbd and library file /System/Library/Frameworks/CoreServices.framework/Versions/A/Frameworks/CarbonCore.framework/Versions/A/CarbonCore are out of sync. Falling back to library file for linking.
ld: warning: text-based stub file /System/Library/Frameworks/CoreServices.framework/Versions/A/Frameworks/Metadata.framework/Versions/A/Metadata.tbd and library file /System/Library/Frameworks/CoreServices.framework/Versions/A/Frameworks/Metadata.framework/Versions/A/Metadata are out of sync. Falling back to library file for linking.
ld: warning: text-based stub file /System/Library/Frameworks/CoreServices.framework/Versions/A/Frameworks/OSServices.framework/Versions/A/OSServices.tbd and library file /System/Library/Frameworks/CoreServices.framework/Versions/A/Frameworks/OSServices.framework/Versions/A/OSServices are out of sync. Falling back to library file for linking.
ld: warning: text-based stub file /System/Library/Frameworks/CoreServices.framework/Versions/A/Frameworks/SearchKit.framework/Versions/A/SearchKit.tbd and library file /System/Library/Frameworks/CoreServices.framework/Versions/A/Frameworks/SearchKit.framework/Versions/A/SearchKit are out of sync. Falling back to library file for linking.
ld: warning: text-based stub file /System/Library/Frameworks/CoreServices.framework/Versions/A/Frameworks/AE.framework/Versions/A/AE.tbd and library file /System/Library/Frameworks/CoreServices.framework/Versions/A/Frameworks/AE.framework/Versions/A/AE are out of sync. Falling back to library file for linking.
ld: warning: text-based stub file /System/Library/Frameworks/CoreServices.framework/Versions/A/Frameworks/LaunchServices.framework/Versions/A/LaunchServices.tbd and library file /System/Library/Frameworks/CoreServices.framework/Versions/A/Frameworks/LaunchServices.framework/Versions/A/LaunchServices are out of sync. Falling back to library file for linking.
ld: warning: text-based stub file /System/Library/Frameworks/CoreServices.framework/Versions/A/Frameworks/DictionaryServices.framework/Versions/A/DictionaryServices.tbd and library file /System/Library/Frameworks/CoreServices.framework/Versions/A/Frameworks/DictionaryServices.framework/Versions/A/DictionaryServices are out of sync. Falling back to library file for linking.
ld: warning: text-based stub file /System/Library/Frameworks/CoreServices.framework/Versions/A/Frameworks/SharedFileList.framework/Versions/A/SharedFileList.tbd and library file /System/Library/Frameworks/CoreServices.framework/Versions/A/Frameworks/SharedFileList.framework/Versions/A/SharedFileList are out of sync. Falling back to library file for linking.
ld: warning: object file (../../../libraries/osx/fmt/lib/libfmt.a(format.cc.o)) was built for newer OSX version (10.13) than being linked (10.12)
ld: warning: text-based stub file /System/Library/Frameworks//CoreFoundation.framework/CoreFoundation.tbd and library file /System/Library/Frameworks//CoreFoundation.framework/CoreFoundation are out of sync. Falling back to library file for linking.
builderr-release-macos.txt
/Applications/Xcode.app/Contents/Developer/Toolchains/XcodeDefault.xctoolchain/usr/bin/ranlib: file: ../../../binaries/system/liblowlevel.a(dbghelp.o) has no symbols
/Applications/Xcode.app/Contents/Developer/Toolchains/XcodeDefault.xctoolchain/usr/bin/ranlib: file: ../../../binaries/system/liblowlevel.a(file_stats.o) has no symbols
/Applications/Xcode.app/Contents/Developer/Toolchains/XcodeDefault.xctoolchain/usr/bin/ranlib: file: ../../../binaries/system/liblowlevel.a(vfs_path.o) has no symbols
/Applications/Xcode.app/Contents/Developer/Toolchains/XcodeDefault.xctoolchain/usr/bin/ranlib: file: ../../../binaries/system/liblowlevel.a(gfx.o) has no symbols
ld: warning: text-based stub file /System/Library/Frameworks//CoreAudio.framework/CoreAudio.tbd and library file /System/Library/Frameworks//CoreAudio.framework/CoreAudio are out of sync. Falling back to library file for linking.
ld: warning: text-based stub file /System/Library/Frameworks//AudioToolbox.framework/AudioToolbox.tbd and library file /System/Library/Frameworks//AudioToolbox.framework/AudioToolbox are out of sync. Falling back to library file for linking.
ld: warning: text-based stub file /System/Library/Frameworks//ForceFeedback.framework/ForceFeedback.tbd and library file /System/Library/Frameworks//ForceFeedback.framework/ForceFeedback are out of sync. Falling back to library file for linking.
ld: warning: text-based stub file /System/Library/Frameworks//CoreVideo.framework/CoreVideo.tbd and library file /System/Library/Frameworks//CoreVideo.framework/CoreVideo are out of sync. Falling back to library file for linking.
ld: warning: text-based stub file /System/Library/Frameworks//Cocoa.framework/Cocoa.tbd and library file /System/Library/Frameworks//Cocoa.framework/Cocoa are out of sync. Falling back to library file for linking.
ld: warning: text-based stub file /System/Library/Frameworks//IOKit.framework/IOKit.tbd and library file /System/Library/Frameworks//IOKit.framework/IOKit are out of sync. Falling back to library file for linking.
ld: warning: text-based stub file /System/Library/Frameworks//QuartzCore.framework/QuartzCore.tbd and library file /System/Library/Frameworks//QuartzCore.framework/QuartzCore are out of sync. Falling back to library file for linking.
ld: warning: text-based stub file /System/Library/Frameworks//Metal.framework/Metal.tbd and library file /System/Library/Frameworks//Metal.framework/Metal are out of sync. Falling back to library file for linking.
ld: warning: text-based stub file /System/Library/Frameworks//Security.framework/Security.tbd and library file /System/Library/Frameworks//Security.framework/Security are out of sync. Falling back to library file for linking.
ld: warning: text-based stub file /System/Library/Frameworks//OpenAL.framework/OpenAL.tbd and library file /System/Library/Frameworks//OpenAL.framework/OpenAL are out of sync. Falling back to library file for linking.
ld: warning: text-based stub file /System/Library/Frameworks//ApplicationServices.framework/ApplicationServices.tbd and library file /System/Library/Frameworks//ApplicationServices.framework/ApplicationServices are out of sync. Falling back to library file for linking.
ld: warning: text-based stub file /System/Library/Frameworks//Cocoa.framework/Cocoa.tbd and library file /System/Library/Frameworks//Cocoa.framework/Cocoa are out of sync. Falling back to library file for linking.
ld: warning: text-based stub file /System/Library/Frameworks//CoreFoundation.framework/CoreFoundation.tbd and library file /System/Library/Frameworks//CoreFoundation.framework/CoreFoundation are out of sync. Falling back to library file for linking.
ld: warning: text-based stub file /System/Library/Frameworks//AppKit.framework/Versions/C/AppKit.tbd and library file /System/Library/Frameworks//AppKit.framework/Versions/C/AppKit are out of sync. Falling back to library file for linking.
ld: warning: text-based stub file /System/Library/Frameworks//CoreData.framework/Versions/A/CoreData.tbd and library file /System/Library/Frameworks//CoreData.framework/Versions/A/CoreData are out of sync. Falling back to library file for linking.
ld: warning: text-based stub file /System/Library/Frameworks/Carbon.framework/Versions/A/Frameworks/CommonPanels.framework/Versions/A/CommonPanels.tbd and library file /System/Library/Frameworks/Carbon.framework/Versions/A/Frameworks/CommonPanels.framework/Versions/A/CommonPanels are out of sync. Falling back to library file for linking.
ld: warning: text-based stub file /System/Library/Frameworks/Carbon.framework/Versions/A/Frameworks/HIToolbox.framework/Versions/A/HIToolbox.tbd and library file /System/Library/Frameworks/Carbon.framework/Versions/A/Frameworks/HIToolbox.framework/Versions/A/HIToolbox are out of sync. Falling back to library file for linking.
ld: warning: text-based stub file /System/Library/Frameworks/Carbon.framework/Versions/A/Frameworks/Help.framework/Versions/A/Help.tbd and library file /System/Library/Frameworks/Carbon.framework/Versions/A/Frameworks/Help.framework/Versions/A/Help are out of sync. Falling back to library file for linking.
ld: warning: text-based stub file /System/Library/Frameworks/Carbon.framework/Versions/A/Frameworks/ImageCapture.framework/Versions/A/ImageCapture.tbd and library file /System/Library/Frameworks/Carbon.framework/Versions/A/Frameworks/ImageCapture.framework/Versions/A/ImageCapture are out of sync. Falling back to library file for linking.
ld: warning: text-based stub file /System/Library/Frameworks/Carbon.framework/Versions/A/Frameworks/Ink.framework/Versions/A/Ink.tbd and library file /System/Library/Frameworks/Carbon.framework/Versions/A/Frameworks/Ink.framework/Versions/A/Ink are out of sync. Falling back to library file for linking.
ld: warning: text-based stub file /System/Library/Frameworks/Carbon.framework/Versions/A/Frameworks/OpenScripting.framework/Versions/A/OpenScripting.tbd and library file /System/Library/Frameworks/Carbon.framework/Versions/A/Frameworks/OpenScripting.framework/Versions/A/OpenScripting are out of sync. Falling back to library file for linking.
ld: warning: text-based stub file /System/Library/Frameworks/Carbon.framework/Versions/A/Frameworks/Print.framework/Versions/A/Print.tbd and library file /System/Library/Frameworks/Carbon.framework/Versions/A/Frameworks/Print.framework/Versions/A/Print are out of sync. Falling back to library file for linking.
ld: warning: text-based stub file /System/Library/Frameworks/Carbon.framework/Versions/A/Frameworks/SecurityHI.framework/Versions/A/SecurityHI.tbd and library file /System/Library/Frameworks/Carbon.framework/Versions/A/Frameworks/SecurityHI.framework/Versions/A/SecurityHI are out of sync. Falling back to library file for linking.
ld: warning: text-based stub file /System/Library/Frameworks/Carbon.framework/Versions/A/Frameworks/SpeechRecognition.framework/Versions/A/SpeechRecognition.tbd and library file /System/Library/Frameworks/Carbon.framework/Versions/A/Frameworks/SpeechRecognition.framework/Versions/A/SpeechRecognition are out of sync. Falling back to library file for linking.
ld: warning: text-based stub file /System/Library/Frameworks//CoreImage.framework/Versions/A/CoreImage.tbd and library file /System/Library/Frameworks//CoreImage.framework/Versions/A/CoreImage are out of sync. Falling back to library file for linking.
ld: warning: text-based stub file /System/Library/Frameworks//CoreGraphics.framework/Versions/A/CoreGraphics.tbd and library file /System/Library/Frameworks//CoreGraphics.framework/Versions/A/CoreGraphics are out of sync. Falling back to library file for linking.
ld: warning: text-based stub file /System/Library/Frameworks//CoreText.framework/Versions/A/CoreText.tbd and library file /System/Library/Frameworks//CoreText.framework/Versions/A/CoreText are out of sync. Falling back to library file for linking.
ld: warning: text-based stub file /System/Library/Frameworks//ImageIO.framework/Versions/A/ImageIO.tbd and library file /System/Library/Frameworks//ImageIO.framework/Versions/A/ImageIO are out of sync. Falling back to library file for linking.
ld: warning: text-based stub file /System/Library/Frameworks//ColorSync.framework/Versions/A/ColorSync.tbd and library file /System/Library/Frameworks//ColorSync.framework/Versions/A/ColorSync are out of sync. Falling back to library file for linking.
ld: warning: text-based stub file /System/Library/Frameworks/ApplicationServices.framework/Versions/A/Frameworks/ATS.framework/Versions/A/ATS.tbd and library file /System/Library/Frameworks/ApplicationServices.framework/Versions/A/Frameworks/ATS.framework/Versions/A/ATS are out of sync. Falling back to library file for linking.
ld: warning: text-based stub file /System/Library/Frameworks/ApplicationServices.framework/Versions/A/Frameworks/ColorSyncLegacy.framework/Versions/A/ColorSyncLegacy.tbd and library file /System/Library/Frameworks/ApplicationServices.framework/Versions/A/Frameworks/ColorSyncLegacy.framework/Versions/A/ColorSyncLegacy are out of sync. Falling back to library file for linking.
ld: warning: text-based stub file /System/Library/Frameworks//CoreServices.framework/Versions/A/CoreServices.tbd and library file /System/Library/Frameworks//CoreServices.framework/Versions/A/CoreServices are out of sync. Falling back to library file for linking.
ld: warning: text-based stub file /System/Library/Frameworks/ApplicationServices.framework/Versions/A/Frameworks/HIServices.framework/Versions/A/HIServices.tbd and library file /System/Library/Frameworks/ApplicationServices.framework/Versions/A/Frameworks/HIServices.framework/Versions/A/HIServices are out of sync. Falling back to library file for linking.
ld: warning: text-based stub file /System/Library/Frameworks/ApplicationServices.framework/Versions/A/Frameworks/LangAnalysis.framework/Versions/A/LangAnalysis.tbd and library file /System/Library/Frameworks/ApplicationServices.framework/Versions/A/Frameworks/LangAnalysis.framework/Versions/A/LangAnalysis are out of sync. Falling back to library file for linking.
ld: warning: text-based stub file /System/Library/Frameworks/ApplicationServices.framework/Versions/A/Frameworks/PrintCore.framework/Versions/A/PrintCore.tbd and library file /System/Library/Frameworks/ApplicationServices.framework/Versions/A/Frameworks/PrintCore.framework/Versions/A/PrintCore are out of sync. Falling back to library file for linking.
ld: warning: text-based stub file /System/Library/Frameworks/ApplicationServices.framework/Versions/A/Frameworks/QD.framework/Versions/A/QD.tbd and library file /System/Library/Frameworks/ApplicationServices.framework/Versions/A/Frameworks/QD.framework/Versions/A/QD are out of sync. Falling back to library file for linking.
ld: warning: text-based stub file /System/Library/Frameworks/ApplicationServices.framework/Versions/A/Frameworks/SpeechSynthesis.framework/Versions/A/SpeechSynthesis.tbd and library file /System/Library/Frameworks/ApplicationServices.framework/Versions/A/Frameworks/SpeechSynthesis.framework/Versions/A/SpeechSynthesis are out of sync. Falling back to library file for linking.
ld: warning: text-based stub file /System/Library/PrivateFrameworks/UIFoundation.framework/Versions/A/UIFoundation.tbd and library file /System/Library/PrivateFrameworks/UIFoundation.framework/Versions/A/UIFoundation are out of sync. Falling back to library file for linking.
ld: warning: text-based stub file /System/Library/Frameworks//Foundation.framework/Versions/C/Foundation.tbd and library file /System/Library/Frameworks//Foundation.framework/Versions/C/Foundation are out of sync. Falling back to library file for linking.
ld: warning: text-based stub file /System/Library/Frameworks//CFNetwork.framework/Versions/A/CFNetwork.tbd and library file /System/Library/Frameworks//CFNetwork.framework/Versions/A/CFNetwork are out of sync. Falling back to library file for linking.
ld: warning: text-based stub file /System/Library/Frameworks/CoreServices.framework/Versions/A/Frameworks/FSEvents.framework/Versions/A/FSEvents.tbd and library file /System/Library/Frameworks/CoreServices.framework/Versions/A/Frameworks/FSEvents.framework/Versions/A/FSEvents are out of sync. Falling back to library file for linking.
ld: warning: text-based stub file /System/Library/Frameworks/CoreServices.framework/Versions/A/Frameworks/CarbonCore.framework/Versions/A/CarbonCore.tbd and library file /System/Library/Frameworks/CoreServices.framework/Versions/A/Frameworks/CarbonCore.framework/Versions/A/CarbonCore are out of sync. Falling back to library file for linking.
ld: warning: text-based stub file /System/Library/Frameworks/CoreServices.framework/Versions/A/Frameworks/Metadata.framework/Versions/A/Metadata.tbd and library file /System/Library/Frameworks/CoreServices.framework/Versions/A/Frameworks/Metadata.framework/Versions/A/Metadata are out of sync. Falling back to library file for linking.
ld: warning: text-based stub file /System/Library/Frameworks/CoreServices.framework/Versions/A/Frameworks/OSServices.framework/Versions/A/OSServices.tbd and library file /System/Library/Frameworks/CoreServices.framework/Versions/A/Frameworks/OSServices.framework/Versions/A/OSServices are out of sync. Falling back to library file for linking.
ld: warning: text-based stub file /System/Library/Frameworks/CoreServices.framework/Versions/A/Frameworks/SearchKit.framework/Versions/A/SearchKit.tbd and library file /System/Library/Frameworks/CoreServices.framework/Versions/A/Frameworks/SearchKit.framework/Versions/A/SearchKit are out of sync. Falling back to library file for linking.
ld: warning: text-based stub file /System/Library/Frameworks/CoreServices.framework/Versions/A/Frameworks/AE.framework/Versions/A/AE.tbd and library file /System/Library/Frameworks/CoreServices.framework/Versions/A/Frameworks/AE.framework/Versions/A/AE are out of sync. Falling back to library file for linking.
ld: warning: text-based stub file /System/Library/Frameworks/CoreServices.framework/Versions/A/Frameworks/LaunchServices.framework/Versions/A/LaunchServices.tbd and library file /System/Library/Frameworks/CoreServices.framework/Versions/A/Frameworks/LaunchServices.framework/Versions/A/LaunchServices are out of sync. Falling back to library file for linking.
ld: warning: text-based stub file /System/Library/Frameworks/CoreServices.framework/Versions/A/Frameworks/DictionaryServices.framework/Versions/A/DictionaryServices.tbd and library file /System/Library/Frameworks/CoreServices.framework/Versions/A/Frameworks/DictionaryServices.framework/Versions/A/DictionaryServices are out of sync. Falling back to library file for linking.
ld: warning: text-based stub file /System/Library/Frameworks/CoreServices.framework/Versions/A/Frameworks/SharedFileList.framework/Versions/A/SharedFileList.tbd and library file /System/Library/Frameworks/CoreServices.framework/Versions/A/Frameworks/SharedFileList.framework/Versions/A/SharedFileList are out of sync. Falling back to library file for linking.
ld: warning: object file (../../../libraries/osx/fmt/lib/libfmt.a(format.cc.o)) was built for newer OSX version (10.13) than being linked (10.12)
ld: warning: text-based stub file /System/Library/Frameworks//CoreFoundation.framework/CoreFoundation.tbd and library file /System/Library/Frameworks//CoreFoundation.framework/CoreFoundation are out of sync. Falling back to library file for linking.
ld: warning: text-based stub file /System/Library/Frameworks//CoreAudio.framework/CoreAudio.tbd and library file /System/Library/Frameworks//CoreAudio.framework/CoreAudio are out of sync. Falling back to library file for linking.
ld: warning: text-based stub file /System/Library/Frameworks//AudioToolbox.framework/AudioToolbox.tbd and library file /System/Library/Frameworks//AudioToolbox.framework/AudioToolbox are out of sync. Falling back to library file for linking.
ld: warning: text-based stub file /System/Library/Frameworks//ForceFeedback.framework/ForceFeedback.tbd and library file /System/Library/Frameworks//ForceFeedback.framework/ForceFeedback are out of sync. Falling back to library file for linking.
ld: warning: text-based stub file /System/Library/Frameworks//CoreVideo.framework/CoreVideo.tbd and library file /System/Library/Frameworks//CoreVideo.framework/CoreVideo are out of sync. Falling back to library file for linking.
ld: warning: text-based stub file /System/Library/Frameworks//Cocoa.framework/Cocoa.tbd and library file /System/Library/Frameworks//Cocoa.framework/Cocoa are out of sync. Falling back to library file for linking.
ld: warning: text-based stub file /System/Library/Frameworks//IOKit.framework/IOKit.tbd and library file /System/Library/Frameworks//IOKit.framework/IOKit are out of sync. Falling back to library file for linking.
ld: warning: text-based stub file /System/Library/Frameworks//QuartzCore.framework/QuartzCore.tbd and library file /System/Library/Frameworks//QuartzCore.framework/QuartzCore are out of sync. Falling back to library file for linking.
ld: warning: text-based stub file /System/Library/Frameworks//Metal.framework/Metal.tbd and library file /System/Library/Frameworks//Metal.framework/Metal are out of sync. Falling back to library file for linking.
ld: warning: text-based stub file /System/Library/Frameworks//Security.framework/Security.tbd and library file /System/Library/Frameworks//Security.framework/Security are out of sync. Falling back to library file for linking.
ld: warning: text-based stub file /System/Library/Frameworks//OpenAL.framework/OpenAL.tbd and library file /System/Library/Frameworks//OpenAL.framework/OpenAL are out of sync. Falling back to library file for linking.
ld: warning: text-based stub file /System/Library/Frameworks//AppKit.framework/Versions/C/AppKit.tbd and library file /System/Library/Frameworks//AppKit.framework/Versions/C/AppKit are out of sync. Falling back to library file for linking.
ld: warning: text-based stub file /System/Library/Frameworks//CoreData.framework/Versions/A/CoreData.tbd and library file /System/Library/Frameworks//CoreData.framework/Versions/A/CoreData are out of sync. Falling back to library file for linking.
ld: warning: text-based stub file /System/Library/Frameworks//ApplicationServices.framework/Versions/A/ApplicationServices.tbd and library file /System/Library/Frameworks//ApplicationServices.framework/Versions/A/ApplicationServices are out of sync. Falling back to library file for linking.
ld: warning: text-based stub file /System/Library/Frameworks/Carbon.framework/Versions/A/Frameworks/CommonPanels.framework/Versions/A/CommonPanels.tbd and library file /System/Library/Frameworks/Carbon.framework/Versions/A/Frameworks/CommonPanels.framework/Versions/A/CommonPanels are out of sync. Falling back to library file for linking.
ld: warning: text-based stub file /System/Library/Frameworks/Carbon.framework/Versions/A/Frameworks/HIToolbox.framework/Versions/A/HIToolbox.tbd and library file /System/Library/Frameworks/Carbon.framework/Versions/A/Frameworks/HIToolbox.framework/Versions/A/HIToolbox are out of sync. Falling back to library file for linking.
ld: warning: text-based stub file /System/Library/Frameworks/Carbon.framework/Versions/A/Frameworks/Help.framework/Versions/A/Help.tbd and library file /System/Library/Frameworks/Carbon.framework/Versions/A/Frameworks/Help.framework/Versions/A/Help are out of sync. Falling back to library file for linking.
ld: warning: text-based stub file /System/Library/Frameworks/Carbon.framework/Versions/A/Frameworks/ImageCapture.framework/Versions/A/ImageCapture.tbd and library file /System/Library/Frameworks/Carbon.framework/Versions/A/Frameworks/ImageCapture.framework/Versions/A/ImageCapture are out of sync. Falling back to library file for linking.
ld: warning: text-based stub file /System/Library/Frameworks/Carbon.framework/Versions/A/Frameworks/Ink.framework/Versions/A/Ink.tbd and library file /System/Library/Frameworks/Carbon.framework/Versions/A/Frameworks/Ink.framework/Versions/A/Ink are out of sync. Falling back to library file for linking.
ld: warning: text-based stub file /System/Library/Frameworks/Carbon.framework/Versions/A/Frameworks/OpenScripting.framework/Versions/A/OpenScripting.tbd and library file /System/Library/Frameworks/Carbon.framework/Versions/A/Frameworks/OpenScripting.framework/Versions/A/OpenScripting are out of sync. Falling back to library file for linking.
ld: warning: text-based stub file /System/Library/Frameworks/Carbon.framework/Versions/A/Frameworks/Print.framework/Versions/A/Print.tbd and library file /System/Library/Frameworks/Carbon.framework/Versions/A/Frameworks/Print.framework/Versions/A/Print are out of sync. Falling back to library file for linking.
ld: warning: text-based stub file /System/Library/Frameworks/Carbon.framework/Versions/A/Frameworks/SecurityHI.framework/Versions/A/SecurityHI.tbd and library file /System/Library/Frameworks/Carbon.framework/Versions/A/Frameworks/SecurityHI.framework/Versions/A/SecurityHI are out of sync. Falling back to library file for linking.
ld: warning: text-based stub file /System/Library/Frameworks/Carbon.framework/Versions/A/Frameworks/SpeechRecognition.framework/Versions/A/SpeechRecognition.tbd and library file /System/Library/Frameworks/Carbon.framework/Versions/A/Frameworks/SpeechRecognition.framework/Versions/A/SpeechRecognition are out of sync. Falling back to library file for linking.
ld: warning: text-based stub file /System/Library/Frameworks//CoreImage.framework/Versions/A/CoreImage.tbd and library file /System/Library/Frameworks//CoreImage.framework/Versions/A/CoreImage are out of sync. Falling back to library file for linking.
ld: warning: text-based stub file /System/Library/Frameworks//CoreGraphics.framework/Versions/A/CoreGraphics.tbd and library file /System/Library/Frameworks//CoreGraphics.framework/Versions/A/CoreGraphics are out of sync. Falling back to library file for linking.
ld: warning: text-based stub file /System/Library/Frameworks//CoreText.framework/Versions/A/CoreText.tbd and library file /System/Library/Frameworks//CoreText.framework/Versions/A/CoreText are out of sync. Falling back to library file for linking.
ld: warning: text-based stub file /System/Library/Frameworks//ImageIO.framework/Versions/A/ImageIO.tbd and library file /System/Library/Frameworks//ImageIO.framework/Versions/A/ImageIO are out of sync. Falling back to library file for linking.
ld: warning: text-based stub file /System/Library/Frameworks//ColorSync.framework/Versions/A/ColorSync.tbd and library file /System/Library/Frameworks//ColorSync.framework/Versions/A/ColorSync are out of sync. Falling back to library file for linking.
ld: warning: text-based stub file /System/Library/Frameworks/ApplicationServices.framework/Versions/A/Frameworks/ATS.framework/Versions/A/ATS.tbd and library file /System/Library/Frameworks/ApplicationServices.framework/Versions/A/Frameworks/ATS.framework/Versions/A/ATS are out of sync. Falling back to library file for linking.
ld: warning: text-based stub file /System/Library/Frameworks/ApplicationServices.framework/Versions/A/Frameworks/ColorSyncLegacy.framework/Versions/A/ColorSyncLegacy.tbd and library file /System/Library/Frameworks/ApplicationServices.framework/Versions/A/Frameworks/ColorSyncLegacy.framework/Versions/A/ColorSyncLegacy are out of sync. Falling back to library file for linking.
ld: warning: text-based stub file /System/Library/Frameworks//CoreServices.framework/Versions/A/CoreServices.tbd and library file /System/Library/Frameworks//CoreServices.framework/Versions/A/CoreServices are out of sync. Falling back to library file for linking.
ld: warning: text-based stub file /System/Library/Frameworks/ApplicationServices.framework/Versions/A/Frameworks/HIServices.framework/Versions/A/HIServices.tbd and library file /System/Library/Frameworks/ApplicationServices.framework/Versions/A/Frameworks/HIServices.framework/Versions/A/HIServices are out of sync. Falling back to library file for linking.
ld: warning: text-based stub file /System/Library/Frameworks/ApplicationServices.framework/Versions/A/Frameworks/LangAnalysis.framework/Versions/A/LangAnalysis.tbd and library file /System/Library/Frameworks/ApplicationServices.framework/Versions/A/Frameworks/LangAnalysis.framework/Versions/A/LangAnalysis are out of sync. Falling back to library file for linking.
ld: warning: text-based stub file /System/Library/Frameworks/ApplicationServices.framework/Versions/A/Frameworks/PrintCore.framework/Versions/A/PrintCore.tbd and library file /System/Library/Frameworks/ApplicationServices.framework/Versions/A/Frameworks/PrintCore.framework/Versions/A/PrintCore are out of sync. Falling back to library file for linking.
ld: warning: text-based stub file /System/Library/Frameworks/ApplicationServices.framework/Versions/A/Frameworks/QD.framework/Versions/A/QD.tbd and library file /System/Library/Frameworks/ApplicationServices.framework/Versions/A/Frameworks/QD.framework/Versions/A/QD are out of sync. Falling back to library file for linking.
ld: warning: text-based stub file /System/Library/Frameworks/ApplicationServices.framework/Versions/A/Frameworks/SpeechSynthesis.framework/Versions/A/SpeechSynthesis.tbd and library file /System/Library/Frameworks/ApplicationServices.framework/Versions/A/Frameworks/SpeechSynthesis.framework/Versions/A/SpeechSynthesis are out of sync. Falling back to library file for linking.
ld: warning: text-based stub file /System/Library/PrivateFrameworks/UIFoundation.framework/Versions/A/UIFoundation.tbd and library file /System/Library/PrivateFrameworks/UIFoundation.framework/Versions/A/UIFoundation are out of sync. Falling back to library file for linking.
ld: warning: text-based stub file /System/Library/Frameworks//Foundation.framework/Versions/C/Foundation.tbd and library file /System/Library/Frameworks//Foundation.framework/Versions/C/Foundation are out of sync. Falling back to library file for linking.
ld: warning: text-based stub file /System/Library/Frameworks//CFNetwork.framework/Versions/A/CFNetwork.tbd and library file /System/Library/Frameworks//CFNetwork.framework/Versions/A/CFNetwork are out of sync. Falling back to library file for linking.
ld: warning: text-based stub file /System/Library/Frameworks/CoreServices.framework/Versions/A/Frameworks/FSEvents.framework/Versions/A/FSEvents.tbd and library file /System/Library/Frameworks/CoreServices.framework/Versions/A/Frameworks/FSEvents.framework/Versions/A/FSEvents are out of sync. Falling back to library file for linking.
ld: warning: text-based stub file /System/Library/Frameworks/CoreServices.framework/Versions/A/Frameworks/CarbonCore.framework/Versions/A/CarbonCore.tbd and library file /System/Library/Frameworks/CoreServices.framework/Versions/A/Frameworks/CarbonCore.framework/Versions/A/CarbonCore are out of sync. Falling back to library file for linking.
ld: warning: text-based stub file /System/Library/Frameworks/CoreServices.framework/Versions/A/Frameworks/Metadata.framework/Versions/A/Metadata.tbd and library file /System/Library/Frameworks/CoreServices.framework/Versions/A/Frameworks/Metadata.framework/Versions/A/Metadata are out of sync. Falling back to library file for linking.
ld: warning: text-based stub file /System/Library/Frameworks/CoreServices.framework/Versions/A/Frameworks/OSServices.framework/Versions/A/OSServices.tbd and library file /System/Library/Frameworks/CoreServices.framework/Versions/A/Frameworks/OSServices.framework/Versions/A/OSServices are out of sync. Falling back to library file for linking.
ld: warning: text-based stub file /System/Library/Frameworks/CoreServices.framework/Versions/A/Frameworks/SearchKit.framework/Versions/A/SearchKit.tbd and library file /System/Library/Frameworks/CoreServices.framework/Versions/A/Frameworks/SearchKit.framework/Versions/A/SearchKit are out of sync. Falling back to library file for linking.
ld: warning: text-based stub file /System/Library/Frameworks//CoreFoundation.framework/Versions/A/CoreFoundation.tbd and library file /System/Library/Frameworks//CoreFoundation.framework/Versions/A/CoreFoundation are out of sync. Falling back to library file for linking.
ld: warning: text-based stub file /System/Library/Frameworks/CoreServices.framework/Versions/A/Frameworks/AE.framework/Versions/A/AE.tbd and library file /System/Library/Frameworks/CoreServices.framework/Versions/A/Frameworks/AE.framework/Versions/A/AE are out of sync. Falling back to library file for linking.
ld: warning: text-based stub file /System/Library/Frameworks/CoreServices.framework/Versions/A/Frameworks/LaunchServices.framework/Versions/A/LaunchServices.tbd and library file /System/Library/Frameworks/CoreServices.framework/Versions/A/Frameworks/LaunchServices.framework/Versions/A/LaunchServices are out of sync. Falling back to library file for linking.
ld: warning: text-based stub file /System/Library/Frameworks/CoreServices.framework/Versions/A/Frameworks/DictionaryServices.framework/Versions/A/DictionaryServices.tbd and library file /System/Library/Frameworks/CoreServices.framework/Versions/A/Frameworks/DictionaryServices.framework/Versions/A/DictionaryServices are out of sync. Falling back to library file for linking.
ld: warning: text-based stub file /System/Library/Frameworks/CoreServices.framework/Versions/A/Frameworks/SharedFileList.framework/Versions/A/SharedFileList.tbd and library file /System/Library/Frameworks/CoreServices.framework/Versions/A/Frameworks/SharedFileList.framework/Versions/A/SharedFileList are out of sync. Falling back to library file for linking.
ld: warning: object file (../../../libraries/osx/fmt/lib/libfmt.a(format.cc.o)) was built for newer OSX version (10.13) than being linked (10.12)
ld: warning: text-based stub file /System/Library/Frameworks//CoreFoundation.framework/CoreFoundation.tbd and library file /System/Library/Frameworks//CoreFoundation.framework/CoreFoundation are out of sync. Falling back to library file for linking.

Link to build: https://jenkins.wildfiregames.com/job/macos-differential/6269/display/redirect

In D4743#201732, @Stan wrote:

They trigger Assertion popups. You're free to ignore suppress them. Except in Atlas where it goes south and crashes the entire game.

So what is the diference betwen WARN_ON_ERROR and ENSURE?

Successful build - Chance fights ever on the side of the prudent.

Debug:
    19>wsecure_crt.obj : warning LNK4221: This object file does not define any previously undefined public symbols, so it will not be used by any link operation that consumes this library [E:\Jenkins\workspace\vs2015-differential\build\workspaces\vs2017\lowlevel.vcxproj]
    19>wprofiler.obj : warning LNK4221: This object file does not define any previously undefined public symbols, so it will not be used by any link operation that consumes this library [E:\Jenkins\workspace\vs2015-differential\build\workspaces\vs2017\lowlevel.vcxproj]
    19>manifest.obj : warning LNK4221: This object file does not define any previously undefined public symbols, so it will not be used by any link operation that consumes this library [E:\Jenkins\workspace\vs2015-differential\build\workspaces\vs2017\lowlevel.vcxproj]
    19>secure_crt.obj : warning LNK4221: This object file does not define any previously undefined public symbols, so it will not be used by any link operation that consumes this library [E:\Jenkins\workspace\vs2015-differential\build\workspaces\vs2017\lowlevel.vcxproj]
    19>posix.obj : warning LNK4221: This object file does not define any previously undefined public symbols, so it will not be used by any link operation that consumes this library [E:\Jenkins\workspace\vs2015-differential\build\workspaces\vs2017\lowlevel.vcxproj]
    19>vfs_path.obj : warning LNK4221: This object file does not define any previously undefined public symbols, so it will not be used by any link operation that consumes this library [E:\Jenkins\workspace\vs2015-differential\build\workspaces\vs2017\lowlevel.vcxproj]
    19>file_stats.obj : warning LNK4221: This object file does not define any previously undefined public symbols, so it will not be used by any link operation that consumes this library [E:\Jenkins\workspace\vs2015-differential\build\workspaces\vs2017\lowlevel.vcxproj]

Link to build: https://jenkins.wildfiregames.com/job/vs2015-differential/7359/display/redirect

Stan added a comment.Jul 25 2022, 9:58 PM

Might try filesystem if that works. I don't remember if nothing worked, or only a subset.

source/lib/sysdep/os/win/wposix/wfilesystem.cpp
138

ErrnoFromStatus(status) == 5 != #define ENOENT 2

140

Missing include.

Stan added a comment.Jul 25 2022, 10:04 PM
In D4743#201732, @Stan wrote:

They trigger Assertion popups. You're free to ignore suppress them. Except in Atlas where it goes south and crashes the entire game.

So what is the diference betwen WARN_ON_ERROR and ENSURE?

I believe its debug_warn() + ENSURE. ENSURE doesn't print to the console. See source/lib/debug.h

In D4743#201740, @Stan wrote:

Might try filesystem if that works. I don't remember if nothing worked, or only a subset.

would be a bigger change

source/lib/sysdep/os/win/wposix/wfilesystem.cpp
138

https://docs.microsoft.com/en-us/windows/win32/debug/system-error-codes--0-499-
would it be GetLastError() == ERROR_FILE_NOT_FOUND on line 130?

Stan added inline comments.Jul 25 2022, 11:09 PM
source/lib/sysdep/os/win/wposix/wfilesystem.cpp
138

GetLastError returns ERROR_PATH_NOT_FOUND which in turn returns ERR::FILE_NOT_FOUND

#define EIO             5
phosit updated this revision to Diff 20671.Jul 26 2022, 7:27 PM

Successful build - Chance fights ever on the side of the prudent.

builderr-debug-macos.txt
/Applications/Xcode.app/Contents/Developer/Toolchains/XcodeDefault.xctoolchain/usr/bin/ranlib: file: ../../../binaries/system/libnetwork_dbg.a(precompiled.o) has no symbols
/Applications/Xcode.app/Contents/Developer/Toolchains/XcodeDefault.xctoolchain/usr/bin/ranlib: file: ../../../binaries/system/libsimulation2_dbg.a(precompiled.o) has no symbols
/Applications/Xcode.app/Contents/Developer/Toolchains/XcodeDefault.xctoolchain/usr/bin/ranlib: file: ../../../binaries/system/libengine_dbg.a(precompiled.o) has no symbols
/Applications/Xcode.app/Contents/Developer/Toolchains/XcodeDefault.xctoolchain/usr/bin/ranlib: file: ../../../binaries/system/libgraphics_dbg.a(precompiled.o) has no symbols
/Applications/Xcode.app/Contents/Developer/Toolchains/XcodeDefault.xctoolchain/usr/bin/ranlib: file: ../../../binaries/system/libatlas_dbg.a(precompiled.o) has no symbols
/Applications/Xcode.app/Contents/Developer/Toolchains/XcodeDefault.xctoolchain/usr/bin/ranlib: file: ../../../binaries/system/libgui_dbg.a(precompiled.o) has no symbols
/Applications/Xcode.app/Contents/Developer/Toolchains/XcodeDefault.xctoolchain/usr/bin/ranlib: file: ../../../binaries/system/liblowlevel_dbg.a(dbghelp.o) has no symbols
/Applications/Xcode.app/Contents/Developer/Toolchains/XcodeDefault.xctoolchain/usr/bin/ranlib: file: ../../../binaries/system/liblowlevel_dbg.a(file_stats.o) has no symbols
/Applications/Xcode.app/Contents/Developer/Toolchains/XcodeDefault.xctoolchain/usr/bin/ranlib: file: ../../../binaries/system/liblowlevel_dbg.a(vfs_path.o) has no symbols
/Applications/Xcode.app/Contents/Developer/Toolchains/XcodeDefault.xctoolchain/usr/bin/ranlib: file: ../../../binaries/system/liblowlevel_dbg.a(gfx.o) has no symbols
ld: warning: text-based stub file /System/Library/Frameworks//CoreAudio.framework/CoreAudio.tbd and library file /System/Library/Frameworks//CoreAudio.framework/CoreAudio are out of sync. Falling back to library file for linking.
ld: warning: text-based stub file /System/Library/Frameworks//AudioToolbox.framework/AudioToolbox.tbd and library file /System/Library/Frameworks//AudioToolbox.framework/AudioToolbox are out of sync. Falling back to library file for linking.
ld: warning: text-based stub file /System/Library/Frameworks//ForceFeedback.framework/ForceFeedback.tbd and library file /System/Library/Frameworks//ForceFeedback.framework/ForceFeedback are out of sync. Falling back to library file for linking.
ld: warning: text-based stub file /System/Library/Frameworks//CoreVideo.framework/CoreVideo.tbd and library file /System/Library/Frameworks//CoreVideo.framework/CoreVideo are out of sync. Falling back to library file for linking.
ld: warning: text-based stub file /System/Library/Frameworks//Cocoa.framework/Cocoa.tbd and library file /System/Library/Frameworks//Cocoa.framework/Cocoa are out of sync. Falling back to library file for linking.
ld: warning: text-based stub file /System/Library/Frameworks//IOKit.framework/IOKit.tbd and library file /System/Library/Frameworks//IOKit.framework/IOKit are out of sync. Falling back to library file for linking.
ld: warning: text-based stub file /System/Library/Frameworks//QuartzCore.framework/QuartzCore.tbd and library file /System/Library/Frameworks//QuartzCore.framework/QuartzCore are out of sync. Falling back to library file for linking.
ld: warning: text-based stub file /System/Library/Frameworks//Metal.framework/Metal.tbd and library file /System/Library/Frameworks//Metal.framework/Metal are out of sync. Falling back to library file for linking.
ld: warning: text-based stub file /System/Library/Frameworks//Security.framework/Security.tbd and library file /System/Library/Frameworks//Security.framework/Security are out of sync. Falling back to library file for linking.
ld: warning: text-based stub file /System/Library/Frameworks//OpenAL.framework/OpenAL.tbd and library file /System/Library/Frameworks//OpenAL.framework/OpenAL are out of sync. Falling back to library file for linking.
ld: warning: text-based stub file /System/Library/Frameworks//ApplicationServices.framework/ApplicationServices.tbd and library file /System/Library/Frameworks//ApplicationServices.framework/ApplicationServices are out of sync. Falling back to library file for linking.
ld: warning: text-based stub file /System/Library/Frameworks//Cocoa.framework/Cocoa.tbd and library file /System/Library/Frameworks//Cocoa.framework/Cocoa are out of sync. Falling back to library file for linking.
ld: warning: text-based stub file /System/Library/Frameworks//CoreFoundation.framework/CoreFoundation.tbd and library file /System/Library/Frameworks//CoreFoundation.framework/CoreFoundation are out of sync. Falling back to library file for linking.
ld: warning: text-based stub file /System/Library/Frameworks//CoreGraphics.framework/Versions/A/CoreGraphics.tbd and library file /System/Library/Frameworks//CoreGraphics.framework/Versions/A/CoreGraphics are out of sync. Falling back to library file for linking.
ld: warning: text-based stub file /System/Library/Frameworks//CoreText.framework/Versions/A/CoreText.tbd and library file /System/Library/Frameworks//CoreText.framework/Versions/A/CoreText are out of sync. Falling back to library file for linking.
ld: warning: text-based stub file /System/Library/Frameworks//ImageIO.framework/Versions/A/ImageIO.tbd and library file /System/Library/Frameworks//ImageIO.framework/Versions/A/ImageIO are out of sync. Falling back to library file for linking.
ld: warning: text-based stub file /System/Library/Frameworks//ColorSync.framework/Versions/A/ColorSync.tbd and library file /System/Library/Frameworks//ColorSync.framework/Versions/A/ColorSync are out of sync. Falling back to library file for linking.
ld: warning: text-based stub file /System/Library/Frameworks/ApplicationServices.framework/Versions/A/Frameworks/ATS.framework/Versions/A/ATS.tbd and library file /System/Library/Frameworks/ApplicationServices.framework/Versions/A/Frameworks/ATS.framework/Versions/A/ATS are out of sync. Falling back to library file for linking.
ld: warning: text-based stub file /System/Library/Frameworks/ApplicationServices.framework/Versions/A/Frameworks/ColorSyncLegacy.framework/Versions/A/ColorSyncLegacy.tbd and library file /System/Library/Frameworks/ApplicationServices.framework/Versions/A/Frameworks/ColorSyncLegacy.framework/Versions/A/ColorSyncLegacy are out of sync. Falling back to library file for linking.
ld: warning: text-based stub file /System/Library/Frameworks//CoreServices.framework/Versions/A/CoreServices.tbd and library file /System/Library/Frameworks//CoreServices.framework/Versions/A/CoreServices are out of sync. Falling back to library file for linking.
ld: warning: text-based stub file /System/Library/Frameworks/ApplicationServices.framework/Versions/A/Frameworks/HIServices.framework/Versions/A/HIServices.tbd and library file /System/Library/Frameworks/ApplicationServices.framework/Versions/A/Frameworks/HIServices.framework/Versions/A/HIServices are out of sync. Falling back to library file for linking.
ld: warning: text-based stub file /System/Library/Frameworks/ApplicationServices.framework/Versions/A/Frameworks/LangAnalysis.framework/Versions/A/LangAnalysis.tbd and library file /System/Library/Frameworks/ApplicationServices.framework/Versions/A/Frameworks/LangAnalysis.framework/Versions/A/LangAnalysis are out of sync. Falling back to library file for linking.
ld: warning: text-based stub file /System/Library/Frameworks/ApplicationServices.framework/Versions/A/Frameworks/PrintCore.framework/Versions/A/PrintCore.tbd and library file /System/Library/Frameworks/ApplicationServices.framework/Versions/A/Frameworks/PrintCore.framework/Versions/A/PrintCore are out of sync. Falling back to library file for linking.
ld: warning: text-based stub file /System/Library/Frameworks/ApplicationServices.framework/Versions/A/Frameworks/QD.framework/Versions/A/QD.tbd and library file /System/Library/Frameworks/ApplicationServices.framework/Versions/A/Frameworks/QD.framework/Versions/A/QD are out of sync. Falling back to library file for linking.
ld: warning: text-based stub file /System/Library/Frameworks/ApplicationServices.framework/Versions/A/Frameworks/SpeechSynthesis.framework/Versions/A/SpeechSynthesis.tbd and library file /System/Library/Frameworks/ApplicationServices.framework/Versions/A/Frameworks/SpeechSynthesis.framework/Versions/A/SpeechSynthesis are out of sync. Falling back to library file for linking.
ld: warning: text-based stub file /System/Library/Frameworks//AppKit.framework/Versions/C/AppKit.tbd and library file /System/Library/Frameworks//AppKit.framework/Versions/C/AppKit are out of sync. Falling back to library file for linking.
ld: warning: text-based stub file /System/Library/Frameworks//CoreData.framework/Versions/A/CoreData.tbd and library file /System/Library/Frameworks//CoreData.framework/Versions/A/CoreData are out of sync. Falling back to library file for linking.
ld: warning: text-based stub file /System/Library/Frameworks/Carbon.framework/Versions/A/Frameworks/CommonPanels.framework/Versions/A/CommonPanels.tbd and library file /System/Library/Frameworks/Carbon.framework/Versions/A/Frameworks/CommonPanels.framework/Versions/A/CommonPanels are out of sync. Falling back to library file for linking.
ld: warning: text-based stub file /System/Library/Frameworks/Carbon.framework/Versions/A/Frameworks/HIToolbox.framework/Versions/A/HIToolbox.tbd and library file /System/Library/Frameworks/Carbon.framework/Versions/A/Frameworks/HIToolbox.framework/Versions/A/HIToolbox are out of sync. Falling back to library file for linking.
ld: warning: text-based stub file /System/Library/Frameworks/Carbon.framework/Versions/A/Frameworks/Help.framework/Versions/A/Help.tbd and library file /System/Library/Frameworks/Carbon.framework/Versions/A/Frameworks/Help.framework/Versions/A/Help are out of sync. Falling back to library file for linking.
ld: warning: text-based stub file /System/Library/Frameworks/Carbon.framework/Versions/A/Frameworks/ImageCapture.framework/Versions/A/ImageCapture.tbd and library file /System/Library/Frameworks/Carbon.framework/Versions/A/Frameworks/ImageCapture.framework/Versions/A/ImageCapture are out of sync. Falling back to library file for linking.
ld: warning: text-based stub file /System/Library/Frameworks/Carbon.framework/Versions/A/Frameworks/Ink.framework/Versions/A/Ink.tbd and library file /System/Library/Frameworks/Carbon.framework/Versions/A/Frameworks/Ink.framework/Versions/A/Ink are out of sync. Falling back to library file for linking.
ld: warning: text-based stub file /System/Library/Frameworks/Carbon.framework/Versions/A/Frameworks/OpenScripting.framework/Versions/A/OpenScripting.tbd and library file /System/Library/Frameworks/Carbon.framework/Versions/A/Frameworks/OpenScripting.framework/Versions/A/OpenScripting are out of sync. Falling back to library file for linking.
ld: warning: text-based stub file /System/Library/Frameworks/Carbon.framework/Versions/A/Frameworks/Print.framework/Versions/A/Print.tbd and library file /System/Library/Frameworks/Carbon.framework/Versions/A/Frameworks/Print.framework/Versions/A/Print are out of sync. Falling back to library file for linking.
ld: warning: text-based stub file /System/Library/Frameworks/Carbon.framework/Versions/A/Frameworks/SecurityHI.framework/Versions/A/SecurityHI.tbd and library file /System/Library/Frameworks/Carbon.framework/Versions/A/Frameworks/SecurityHI.framework/Versions/A/SecurityHI are out of sync. Falling back to library file for linking.
ld: warning: text-based stub file /System/Library/Frameworks/Carbon.framework/Versions/A/Frameworks/SpeechRecognition.framework/Versions/A/SpeechRecognition.tbd and library file /System/Library/Frameworks/Carbon.framework/Versions/A/Frameworks/SpeechRecognition.framework/Versions/A/SpeechRecognition are out of sync. Falling back to library file for linking.
ld: warning: text-based stub file /System/Library/Frameworks//CoreImage.framework/Versions/A/CoreImage.tbd and library file /System/Library/Frameworks//CoreImage.framework/Versions/A/CoreImage are out of sync. Falling back to library file for linking.
ld: warning: text-based stub file /System/Library/Frameworks//CFNetwork.framework/Versions/A/CFNetwork.tbd and library file /System/Library/Frameworks//CFNetwork.framework/Versions/A/CFNetwork are out of sync. Falling back to library file for linking.
ld: warning: text-based stub file /System/Library/Frameworks/CoreServices.framework/Versions/A/Frameworks/FSEvents.framework/Versions/A/FSEvents.tbd and library file /System/Library/Frameworks/CoreServices.framework/Versions/A/Frameworks/FSEvents.framework/Versions/A/FSEvents are out of sync. Falling back to library file for linking.
ld: warning: text-based stub file /System/Library/Frameworks/CoreServices.framework/Versions/A/Frameworks/CarbonCore.framework/Versions/A/CarbonCore.tbd and library file /System/Library/Frameworks/CoreServices.framework/Versions/A/Frameworks/CarbonCore.framework/Versions/A/CarbonCore are out of sync. Falling back to library file for linking.
ld: warning: text-based stub file /System/Library/Frameworks/CoreServices.framework/Versions/A/Frameworks/Metadata.framework/Versions/A/Metadata.tbd and library file /System/Library/Frameworks/CoreServices.framework/Versions/A/Frameworks/Metadata.framework/Versions/A/Metadata are out of sync. Falling back to library file for linking.
ld: warning: text-based stub file /System/Library/Frameworks/CoreServices.framework/Versions/A/Frameworks/OSServices.framework/Versions/A/OSServices.tbd and library file /System/Library/Frameworks/CoreServices.framework/Versions/A/Frameworks/OSServices.framework/Versions/A/OSServices are out of sync. Falling back to library file for linking.
ld: warning: text-based stub file /System/Library/Frameworks/CoreServices.framework/Versions/A/Frameworks/SearchKit.framework/Versions/A/SearchKit.tbd and library file /System/Library/Frameworks/CoreServices.framework/Versions/A/Frameworks/SearchKit.framework/Versions/A/SearchKit are out of sync. Falling back to library file for linking.
ld: warning: text-based stub file /System/Library/Frameworks/CoreServices.framework/Versions/A/Frameworks/AE.framework/Versions/A/AE.tbd and library file /System/Library/Frameworks/CoreServices.framework/Versions/A/Frameworks/AE.framework/Versions/A/AE are out of sync. Falling back to library file for linking.
ld: warning: text-based stub file /System/Library/Frameworks/CoreServices.framework/Versions/A/Frameworks/LaunchServices.framework/Versions/A/LaunchServices.tbd and library file /System/Library/Frameworks/CoreServices.framework/Versions/A/Frameworks/LaunchServices.framework/Versions/A/LaunchServices are out of sync. Falling back to library file for linking.
ld: warning: text-based stub file /System/Library/Frameworks/CoreServices.framework/Versions/A/Frameworks/DictionaryServices.framework/Versions/A/DictionaryServices.tbd and library file /System/Library/Frameworks/CoreServices.framework/Versions/A/Frameworks/DictionaryServices.framework/Versions/A/DictionaryServices are out of sync. Falling back to library file for linking.
ld: warning: text-based stub file /System/Library/Frameworks/CoreServices.framework/Versions/A/Frameworks/SharedFileList.framework/Versions/A/SharedFileList.tbd and library file /System/Library/Frameworks/CoreServices.framework/Versions/A/Frameworks/SharedFileList.framework/Versions/A/SharedFileList are out of sync. Falling back to library file for linking.
ld: warning: text-based stub file /System/Library/PrivateFrameworks/UIFoundation.framework/Versions/A/UIFoundation.tbd and library file /System/Library/PrivateFrameworks/UIFoundation.framework/Versions/A/UIFoundation are out of sync. Falling back to library file for linking.
ld: warning: text-based stub file /System/Library/Frameworks//Foundation.framework/Versions/C/Foundation.tbd and library file /System/Library/Frameworks//Foundation.framework/Versions/C/Foundation are out of sync. Falling back to library file for linking.
ld: warning: object file (../../../libraries/osx/fmt/lib/libfmt.a(format.cc.o)) was built for newer OSX version (10.13) than being linked (10.12)
ld: warning: text-based stub file /System/Library/Frameworks//CoreFoundation.framework/CoreFoundation.tbd and library file /System/Library/Frameworks//CoreFoundation.framework/CoreFoundation are out of sync. Falling back to library file for linking.
ld: warning: text-based stub file /System/Library/Frameworks//CoreAudio.framework/CoreAudio.tbd and library file /System/Library/Frameworks//CoreAudio.framework/CoreAudio are out of sync. Falling back to library file for linking.
ld: warning: text-based stub file /System/Library/Frameworks//AudioToolbox.framework/AudioToolbox.tbd and library file /System/Library/Frameworks//AudioToolbox.framework/AudioToolbox are out of sync. Falling back to library file for linking.
ld: warning: text-based stub file /System/Library/Frameworks//ForceFeedback.framework/ForceFeedback.tbd and library file /System/Library/Frameworks//ForceFeedback.framework/ForceFeedback are out of sync. Falling back to library file for linking.
ld: warning: text-based stub file /System/Library/Frameworks//CoreVideo.framework/CoreVideo.tbd and library file /System/Library/Frameworks//CoreVideo.framework/CoreVideo are out of sync. Falling back to library file for linking.
ld: warning: text-based stub file /System/Library/Frameworks//Cocoa.framework/Cocoa.tbd and library file /System/Library/Frameworks//Cocoa.framework/Cocoa are out of sync. Falling back to library file for linking.
ld: warning: text-based stub file /System/Library/Frameworks//IOKit.framework/IOKit.tbd and library file /System/Library/Frameworks//IOKit.framework/IOKit are out of sync. Falling back to library file for linking.
ld: warning: text-based stub file /System/Library/Frameworks//QuartzCore.framework/QuartzCore.tbd and library file /System/Library/Frameworks//QuartzCore.framework/QuartzCore are out of sync. Falling back to library file for linking.
ld: warning: text-based stub file /System/Library/Frameworks//Metal.framework/Metal.tbd and library file /System/Library/Frameworks//Metal.framework/Metal are out of sync. Falling back to library file for linking.
ld: warning: text-based stub file /System/Library/Frameworks//Security.framework/Security.tbd and library file /System/Library/Frameworks//Security.framework/Security are out of sync. Falling back to library file for linking.
ld: warning: text-based stub file /System/Library/Frameworks//OpenAL.framework/OpenAL.tbd and library file /System/Library/Frameworks//OpenAL.framework/OpenAL are out of sync. Falling back to library file for linking.
ld: warning: text-based stub file /System/Library/Frameworks//AppKit.framework/Versions/C/AppKit.tbd and library file /System/Library/Frameworks//AppKit.framework/Versions/C/AppKit are out of sync. Falling back to library file for linking.
ld: warning: text-based stub file /System/Library/Frameworks//CoreData.framework/Versions/A/CoreData.tbd and library file /System/Library/Frameworks//CoreData.framework/Versions/A/CoreData are out of sync. Falling back to library file for linking.
ld: warning: text-based stub file /System/Library/Frameworks//ApplicationServices.framework/Versions/A/ApplicationServices.tbd and library file /System/Library/Frameworks//ApplicationServices.framework/Versions/A/ApplicationServices are out of sync. Falling back to library file for linking.
ld: warning: text-based stub file /System/Library/Frameworks/Carbon.framework/Versions/A/Frameworks/CommonPanels.framework/Versions/A/CommonPanels.tbd and library file /System/Library/Frameworks/Carbon.framework/Versions/A/Frameworks/CommonPanels.framework/Versions/A/CommonPanels are out of sync. Falling back to library file for linking.
ld: warning: text-based stub file /System/Library/Frameworks/Carbon.framework/Versions/A/Frameworks/HIToolbox.framework/Versions/A/HIToolbox.tbd and library file /System/Library/Frameworks/Carbon.framework/Versions/A/Frameworks/HIToolbox.framework/Versions/A/HIToolbox are out of sync. Falling back to library file for linking.
ld: warning: text-based stub file /System/Library/Frameworks/Carbon.framework/Versions/A/Frameworks/Help.framework/Versions/A/Help.tbd and library file /System/Library/Frameworks/Carbon.framework/Versions/A/Frameworks/Help.framework/Versions/A/Help are out of sync. Falling back to library file for linking.
ld: warning: text-based stub file /System/Library/Frameworks/Carbon.framework/Versions/A/Frameworks/ImageCapture.framework/Versions/A/ImageCapture.tbd and library file /System/Library/Frameworks/Carbon.framework/Versions/A/Frameworks/ImageCapture.framework/Versions/A/ImageCapture are out of sync. Falling back to library file for linking.
ld: warning: text-based stub file /System/Library/Frameworks/Carbon.framework/Versions/A/Frameworks/Ink.framework/Versions/A/Ink.tbd and library file /System/Library/Frameworks/Carbon.framework/Versions/A/Frameworks/Ink.framework/Versions/A/Ink are out of sync. Falling back to library file for linking.
ld: warning: text-based stub file /System/Library/Frameworks/Carbon.framework/Versions/A/Frameworks/OpenScripting.framework/Versions/A/OpenScripting.tbd and library file /System/Library/Frameworks/Carbon.framework/Versions/A/Frameworks/OpenScripting.framework/Versions/A/OpenScripting are out of sync. Falling back to library file for linking.
ld: warning: text-based stub file /System/Library/Frameworks/Carbon.framework/Versions/A/Frameworks/Print.framework/Versions/A/Print.tbd and library file /System/Library/Frameworks/Carbon.framework/Versions/A/Frameworks/Print.framework/Versions/A/Print are out of sync. Falling back to library file for linking.
ld: warning: text-based stub file /System/Library/Frameworks/Carbon.framework/Versions/A/Frameworks/SecurityHI.framework/Versions/A/SecurityHI.tbd and library file /System/Library/Frameworks/Carbon.framework/Versions/A/Frameworks/SecurityHI.framework/Versions/A/SecurityHI are out of sync. Falling back to library file for linking.
ld: warning: text-based stub file /System/Library/Frameworks/Carbon.framework/Versions/A/Frameworks/SpeechRecognition.framework/Versions/A/SpeechRecognition.tbd and library file /System/Library/Frameworks/Carbon.framework/Versions/A/Frameworks/SpeechRecognition.framework/Versions/A/SpeechRecognition are out of sync. Falling back to library file for linking.
ld: warning: text-based stub file /System/Library/Frameworks//CoreImage.framework/Versions/A/CoreImage.tbd and library file /System/Library/Frameworks//CoreImage.framework/Versions/A/CoreImage are out of sync. Falling back to library file for linking.
ld: warning: text-based stub file /System/Library/PrivateFrameworks/UIFoundation.framework/Versions/A/UIFoundation.tbd and library file /System/Library/PrivateFrameworks/UIFoundation.framework/Versions/A/UIFoundation are out of sync. Falling back to library file for linking.
ld: warning: text-based stub file /System/Library/Frameworks//Foundation.framework/Versions/C/Foundation.tbd and library file /System/Library/Frameworks//Foundation.framework/Versions/C/Foundation are out of sync. Falling back to library file for linking.
ld: warning: text-based stub file /System/Library/Frameworks//CoreGraphics.framework/Versions/A/CoreGraphics.tbd and library file /System/Library/Frameworks//CoreGraphics.framework/Versions/A/CoreGraphics are out of sync. Falling back to library file for linking.
ld: warning: text-based stub file /System/Library/Frameworks//CoreText.framework/Versions/A/CoreText.tbd and library file /System/Library/Frameworks//CoreText.framework/Versions/A/CoreText are out of sync. Falling back to library file for linking.
ld: warning: text-based stub file /System/Library/Frameworks//ImageIO.framework/Versions/A/ImageIO.tbd and library file /System/Library/Frameworks//ImageIO.framework/Versions/A/ImageIO are out of sync. Falling back to library file for linking.
ld: warning: text-based stub file /System/Library/Frameworks//ColorSync.framework/Versions/A/ColorSync.tbd and library file /System/Library/Frameworks//ColorSync.framework/Versions/A/ColorSync are out of sync. Falling back to library file for linking.
ld: warning: text-based stub file /System/Library/Frameworks/ApplicationServices.framework/Versions/A/Frameworks/ATS.framework/Versions/A/ATS.tbd and library file /System/Library/Frameworks/ApplicationServices.framework/Versions/A/Frameworks/ATS.framework/Versions/A/ATS are out of sync. Falling back to library file for linking.
ld: warning: text-based stub file /System/Library/Frameworks/ApplicationServices.framework/Versions/A/Frameworks/ColorSyncLegacy.framework/Versions/A/ColorSyncLegacy.tbd and library file /System/Library/Frameworks/ApplicationServices.framework/Versions/A/Frameworks/ColorSyncLegacy.framework/Versions/A/ColorSyncLegacy are out of sync. Falling back to library file for linking.
ld: warning: text-based stub file /System/Library/Frameworks//CoreServices.framework/Versions/A/CoreServices.tbd and library file /System/Library/Frameworks//CoreServices.framework/Versions/A/CoreServices are out of sync. Falling back to library file for linking.
ld: warning: text-based stub file /System/Library/Frameworks/ApplicationServices.framework/Versions/A/Frameworks/HIServices.framework/Versions/A/HIServices.tbd and library file /System/Library/Frameworks/ApplicationServices.framework/Versions/A/Frameworks/HIServices.framework/Versions/A/HIServices are out of sync. Falling back to library file for linking.
ld: warning: text-based stub file /System/Library/Frameworks/ApplicationServices.framework/Versions/A/Frameworks/LangAnalysis.framework/Versions/A/LangAnalysis.tbd and library file /System/Library/Frameworks/ApplicationServices.framework/Versions/A/Frameworks/LangAnalysis.framework/Versions/A/LangAnalysis are out of sync. Falling back to library file for linking.
ld: warning: text-based stub file /System/Library/Frameworks/ApplicationServices.framework/Versions/A/Frameworks/PrintCore.framework/Versions/A/PrintCore.tbd and library file /System/Library/Frameworks/ApplicationServices.framework/Versions/A/Frameworks/PrintCore.framework/Versions/A/PrintCore are out of sync. Falling back to library file for linking.
ld: warning: text-based stub file /System/Library/Frameworks/ApplicationServices.framework/Versions/A/Frameworks/QD.framework/Versions/A/QD.tbd and library file /System/Library/Frameworks/ApplicationServices.framework/Versions/A/Frameworks/QD.framework/Versions/A/QD are out of sync. Falling back to library file for linking.
ld: warning: text-based stub file /System/Library/Frameworks/ApplicationServices.framework/Versions/A/Frameworks/SpeechSynthesis.framework/Versions/A/SpeechSynthesis.tbd and library file /System/Library/Frameworks/ApplicationServices.framework/Versions/A/Frameworks/SpeechSynthesis.framework/Versions/A/SpeechSynthesis are out of sync. Falling back to library file for linking.
ld: warning: text-based stub file /System/Library/Frameworks//CoreFoundation.framework/Versions/A/CoreFoundation.tbd and library file /System/Library/Frameworks//CoreFoundation.framework/Versions/A/CoreFoundation are out of sync. Falling back to library file for linking.
ld: warning: text-based stub file /System/Library/Frameworks//CFNetwork.framework/Versions/A/CFNetwork.tbd and library file /System/Library/Frameworks//CFNetwork.framework/Versions/A/CFNetwork are out of sync. Falling back to library file for linking.
ld: warning: text-based stub file /System/Library/Frameworks/CoreServices.framework/Versions/A/Frameworks/FSEvents.framework/Versions/A/FSEvents.tbd and library file /System/Library/Frameworks/CoreServices.framework/Versions/A/Frameworks/FSEvents.framework/Versions/A/FSEvents are out of sync. Falling back to library file for linking.
ld: warning: text-based stub file /System/Library/Frameworks/CoreServices.framework/Versions/A/Frameworks/CarbonCore.framework/Versions/A/CarbonCore.tbd and library file /System/Library/Frameworks/CoreServices.framework/Versions/A/Frameworks/CarbonCore.framework/Versions/A/CarbonCore are out of sync. Falling back to library file for linking.
ld: warning: text-based stub file /System/Library/Frameworks/CoreServices.framework/Versions/A/Frameworks/Metadata.framework/Versions/A/Metadata.tbd and library file /System/Library/Frameworks/CoreServices.framework/Versions/A/Frameworks/Metadata.framework/Versions/A/Metadata are out of sync. Falling back to library file for linking.
ld: warning: text-based stub file /System/Library/Frameworks/CoreServices.framework/Versions/A/Frameworks/OSServices.framework/Versions/A/OSServices.tbd and library file /System/Library/Frameworks/CoreServices.framework/Versions/A/Frameworks/OSServices.framework/Versions/A/OSServices are out of sync. Falling back to library file for linking.
ld: warning: text-based stub file /System/Library/Frameworks/CoreServices.framework/Versions/A/Frameworks/SearchKit.framework/Versions/A/SearchKit.tbd and library file /System/Library/Frameworks/CoreServices.framework/Versions/A/Frameworks/SearchKit.framework/Versions/A/SearchKit are out of sync. Falling back to library file for linking.
ld: warning: text-based stub file /System/Library/Frameworks/CoreServices.framework/Versions/A/Frameworks/AE.framework/Versions/A/AE.tbd and library file /System/Library/Frameworks/CoreServices.framework/Versions/A/Frameworks/AE.framework/Versions/A/AE are out of sync. Falling back to library file for linking.
ld: warning: text-based stub file /System/Library/Frameworks/CoreServices.framework/Versions/A/Frameworks/LaunchServices.framework/Versions/A/LaunchServices.tbd and library file /System/Library/Frameworks/CoreServices.framework/Versions/A/Frameworks/LaunchServices.framework/Versions/A/LaunchServices are out of sync. Falling back to library file for linking.
ld: warning: text-based stub file /System/Library/Frameworks/CoreServices.framework/Versions/A/Frameworks/DictionaryServices.framework/Versions/A/DictionaryServices.tbd and library file /System/Library/Frameworks/CoreServices.framework/Versions/A/Frameworks/DictionaryServices.framework/Versions/A/DictionaryServices are out of sync. Falling back to library file for linking.
ld: warning: text-based stub file /System/Library/Frameworks/CoreServices.framework/Versions/A/Frameworks/SharedFileList.framework/Versions/A/SharedFileList.tbd and library file /System/Library/Frameworks/CoreServices.framework/Versions/A/Frameworks/SharedFileList.framework/Versions/A/SharedFileList are out of sync. Falling back to library file for linking.
ld: warning: object file (../../../libraries/osx/fmt/lib/libfmt.a(format.cc.o)) was built for newer OSX version (10.13) than being linked (10.12)
ld: warning: text-based stub file /System/Library/Frameworks//CoreFoundation.framework/CoreFoundation.tbd and library file /System/Library/Frameworks//CoreFoundation.framework/CoreFoundation are out of sync. Falling back to library file for linking.
builderr-release-macos.txt
/Applications/Xcode.app/Contents/Developer/Toolchains/XcodeDefault.xctoolchain/usr/bin/ranlib: file: ../../../binaries/system/libnetwork.a(precompiled.o) has no symbols
/Applications/Xcode.app/Contents/Developer/Toolchains/XcodeDefault.xctoolchain/usr/bin/ranlib: file: ../../../binaries/system/libsimulation2.a(precompiled.o) has no symbols
/Applications/Xcode.app/Contents/Developer/Toolchains/XcodeDefault.xctoolchain/usr/bin/ranlib: file: ../../../binaries/system/libengine.a(precompiled.o) has no symbols
/Applications/Xcode.app/Contents/Developer/Toolchains/XcodeDefault.xctoolchain/usr/bin/ranlib: file: ../../../binaries/system/libgraphics.a(precompiled.o) has no symbols
/Applications/Xcode.app/Contents/Developer/Toolchains/XcodeDefault.xctoolchain/usr/bin/ranlib: file: ../../../binaries/system/libatlas.a(precompiled.o) has no symbols
/Applications/Xcode.app/Contents/Developer/Toolchains/XcodeDefault.xctoolchain/usr/bin/ranlib: file: ../../../binaries/system/libgui.a(precompiled.o) has no symbols
/Applications/Xcode.app/Contents/Developer/Toolchains/XcodeDefault.xctoolchain/usr/bin/ranlib: file: ../../../binaries/system/liblowlevel.a(dbghelp.o) has no symbols
/Applications/Xcode.app/Contents/Developer/Toolchains/XcodeDefault.xctoolchain/usr/bin/ranlib: file: ../../../binaries/system/liblowlevel.a(file_stats.o) has no symbols
/Applications/Xcode.app/Contents/Developer/Toolchains/XcodeDefault.xctoolchain/usr/bin/ranlib: file: ../../../binaries/system/liblowlevel.a(vfs_path.o) has no symbols
/Applications/Xcode.app/Contents/Developer/Toolchains/XcodeDefault.xctoolchain/usr/bin/ranlib: file: ../../../binaries/system/liblowlevel.a(gfx.o) has no symbols
ld: warning: text-based stub file /System/Library/Frameworks//CoreAudio.framework/CoreAudio.tbd and library file /System/Library/Frameworks//CoreAudio.framework/CoreAudio are out of sync. Falling back to library file for linking.
ld: warning: text-based stub file /System/Library/Frameworks//AudioToolbox.framework/AudioToolbox.tbd and library file /System/Library/Frameworks//AudioToolbox.framework/AudioToolbox are out of sync. Falling back to library file for linking.
ld: warning: text-based stub file /System/Library/Frameworks//ForceFeedback.framework/ForceFeedback.tbd and library file /System/Library/Frameworks//ForceFeedback.framework/ForceFeedback are out of sync. Falling back to library file for linking.
ld: warning: text-based stub file /System/Library/Frameworks//CoreVideo.framework/CoreVideo.tbd and library file /System/Library/Frameworks//CoreVideo.framework/CoreVideo are out of sync. Falling back to library file for linking.
ld: warning: text-based stub file /System/Library/Frameworks//Cocoa.framework/Cocoa.tbd and library file /System/Library/Frameworks//Cocoa.framework/Cocoa are out of sync. Falling back to library file for linking.
ld: warning: text-based stub file /System/Library/Frameworks//IOKit.framework/IOKit.tbd and library file /System/Library/Frameworks//IOKit.framework/IOKit are out of sync. Falling back to library file for linking.
ld: warning: text-based stub file /System/Library/Frameworks//QuartzCore.framework/QuartzCore.tbd and library file /System/Library/Frameworks//QuartzCore.framework/QuartzCore are out of sync. Falling back to library file for linking.
ld: warning: text-based stub file /System/Library/Frameworks//Metal.framework/Metal.tbd and library file /System/Library/Frameworks//Metal.framework/Metal are out of sync. Falling back to library file for linking.
ld: warning: text-based stub file /System/Library/Frameworks//Security.framework/Security.tbd and library file /System/Library/Frameworks//Security.framework/Security are out of sync. Falling back to library file for linking.
ld: warning: text-based stub file /System/Library/Frameworks//OpenAL.framework/OpenAL.tbd and library file /System/Library/Frameworks//OpenAL.framework/OpenAL are out of sync. Falling back to library file for linking.
ld: warning: text-based stub file /System/Library/Frameworks//ApplicationServices.framework/ApplicationServices.tbd and library file /System/Library/Frameworks//ApplicationServices.framework/ApplicationServices are out of sync. Falling back to library file for linking.
ld: warning: text-based stub file /System/Library/Frameworks//Cocoa.framework/Cocoa.tbd and library file /System/Library/Frameworks//Cocoa.framework/Cocoa are out of sync. Falling back to library file for linking.
ld: warning: text-based stub file /System/Library/Frameworks//CoreFoundation.framework/CoreFoundation.tbd and library file /System/Library/Frameworks//CoreFoundation.framework/CoreFoundation are out of sync. Falling back to library file for linking.
ld: warning: text-based stub file /System/Library/Frameworks//AppKit.framework/Versions/C/AppKit.tbd and library file /System/Library/Frameworks//AppKit.framework/Versions/C/AppKit are out of sync. Falling back to library file for linking.
ld: warning: text-based stub file /System/Library/Frameworks//CoreData.framework/Versions/A/CoreData.tbd and library file /System/Library/Frameworks//CoreData.framework/Versions/A/CoreData are out of sync. Falling back to library file for linking.
ld: warning: text-based stub file /System/Library/Frameworks//CoreImage.framework/Versions/A/CoreImage.tbd and library file /System/Library/Frameworks//CoreImage.framework/Versions/A/CoreImage are out of sync. Falling back to library file for linking.
ld: warning: text-based stub file /System/Library/Frameworks//CoreGraphics.framework/Versions/A/CoreGraphics.tbd and library file /System/Library/Frameworks//CoreGraphics.framework/Versions/A/CoreGraphics are out of sync. Falling back to library file for linking.
ld: warning: text-based stub file /System/Library/Frameworks//CoreText.framework/Versions/A/CoreText.tbd and library file /System/Library/Frameworks//CoreText.framework/Versions/A/CoreText are out of sync. Falling back to library file for linking.
ld: warning: text-based stub file /System/Library/Frameworks//ImageIO.framework/Versions/A/ImageIO.tbd and library file /System/Library/Frameworks//ImageIO.framework/Versions/A/ImageIO are out of sync. Falling back to library file for linking.
ld: warning: text-based stub file /System/Library/Frameworks//ColorSync.framework/Versions/A/ColorSync.tbd and library file /System/Library/Frameworks//ColorSync.framework/Versions/A/ColorSync are out of sync. Falling back to library file for linking.
ld: warning: text-based stub file /System/Library/Frameworks/ApplicationServices.framework/Versions/A/Frameworks/ATS.framework/Versions/A/ATS.tbd and library file /System/Library/Frameworks/ApplicationServices.framework/Versions/A/Frameworks/ATS.framework/Versions/A/ATS are out of sync. Falling back to library file for linking.
ld: warning: text-based stub file /System/Library/Frameworks/ApplicationServices.framework/Versions/A/Frameworks/ColorSyncLegacy.framework/Versions/A/ColorSyncLegacy.tbd and library file /System/Library/Frameworks/ApplicationServices.framework/Versions/A/Frameworks/ColorSyncLegacy.framework/Versions/A/ColorSyncLegacy are out of sync. Falling back to library file for linking.
ld: warning: text-based stub file /System/Library/Frameworks//CoreServices.framework/Versions/A/CoreServices.tbd and library file /System/Library/Frameworks//CoreServices.framework/Versions/A/CoreServices are out of sync. Falling back to library file for linking.
ld: warning: text-based stub file /System/Library/Frameworks/ApplicationServices.framework/Versions/A/Frameworks/HIServices.framework/Versions/A/HIServices.tbd and library file /System/Library/Frameworks/ApplicationServices.framework/Versions/A/Frameworks/HIServices.framework/Versions/A/HIServices are out of sync. Falling back to library file for linking.
ld: warning: text-based stub file /System/Library/Frameworks/ApplicationServices.framework/Versions/A/Frameworks/LangAnalysis.framework/Versions/A/LangAnalysis.tbd and library file /System/Library/Frameworks/ApplicationServices.framework/Versions/A/Frameworks/LangAnalysis.framework/Versions/A/LangAnalysis are out of sync. Falling back to library file for linking.
ld: warning: text-based stub file /System/Library/Frameworks/ApplicationServices.framework/Versions/A/Frameworks/PrintCore.framework/Versions/A/PrintCore.tbd and library file /System/Library/Frameworks/ApplicationServices.framework/Versions/A/Frameworks/PrintCore.framework/Versions/A/PrintCore are out of sync. Falling back to library file for linking.
ld: warning: text-based stub file /System/Library/Frameworks/ApplicationServices.framework/Versions/A/Frameworks/QD.framework/Versions/A/QD.tbd and library file /System/Library/Frameworks/ApplicationServices.framework/Versions/A/Frameworks/QD.framework/Versions/A/QD are out of sync. Falling back to library file for linking.
ld: warning: text-based stub file /System/Library/Frameworks/ApplicationServices.framework/Versions/A/Frameworks/SpeechSynthesis.framework/Versions/A/SpeechSynthesis.tbd and library file /System/Library/Frameworks/ApplicationServices.framework/Versions/A/Frameworks/SpeechSynthesis.framework/Versions/A/SpeechSynthesis are out of sync. Falling back to library file for linking.
ld: warning: text-based stub file /System/Library/Frameworks/Carbon.framework/Versions/A/Frameworks/CommonPanels.framework/Versions/A/CommonPanels.tbd and library file /System/Library/Frameworks/Carbon.framework/Versions/A/Frameworks/CommonPanels.framework/Versions/A/CommonPanels are out of sync. Falling back to library file for linking.
ld: warning: text-based stub file /System/Library/Frameworks/Carbon.framework/Versions/A/Frameworks/HIToolbox.framework/Versions/A/HIToolbox.tbd and library file /System/Library/Frameworks/Carbon.framework/Versions/A/Frameworks/HIToolbox.framework/Versions/A/HIToolbox are out of sync. Falling back to library file for linking.
ld: warning: text-based stub file /System/Library/Frameworks/Carbon.framework/Versions/A/Frameworks/Help.framework/Versions/A/Help.tbd and library file /System/Library/Frameworks/Carbon.framework/Versions/A/Frameworks/Help.framework/Versions/A/Help are out of sync. Falling back to library file for linking.
ld: warning: text-based stub file /System/Library/Frameworks/Carbon.framework/Versions/A/Frameworks/ImageCapture.framework/Versions/A/ImageCapture.tbd and library file /System/Library/Frameworks/Carbon.framework/Versions/A/Frameworks/ImageCapture.framework/Versions/A/ImageCapture are out of sync. Falling back to library file for linking.
ld: warning: text-based stub file /System/Library/Frameworks/Carbon.framework/Versions/A/Frameworks/Ink.framework/Versions/A/Ink.tbd and library file /System/Library/Frameworks/Carbon.framework/Versions/A/Frameworks/Ink.framework/Versions/A/Ink are out of sync. Falling back to library file for linking.
ld: warning: text-based stub file /System/Library/Frameworks/Carbon.framework/Versions/A/Frameworks/OpenScripting.framework/Versions/A/OpenScripting.tbd and library file /System/Library/Frameworks/Carbon.framework/Versions/A/Frameworks/OpenScripting.framework/Versions/A/OpenScripting are out of sync. Falling back to library file for linking.
ld: warning: text-based stub file /System/Library/Frameworks/Carbon.framework/Versions/A/Frameworks/Print.framework/Versions/A/Print.tbd and library file /System/Library/Frameworks/Carbon.framework/Versions/A/Frameworks/Print.framework/Versions/A/Print are out of sync. Falling back to library file for linking.
ld: warning: text-based stub file /System/Library/Frameworks/Carbon.framework/Versions/A/Frameworks/SecurityHI.framework/Versions/A/SecurityHI.tbd and library file /System/Library/Frameworks/Carbon.framework/Versions/A/Frameworks/SecurityHI.framework/Versions/A/SecurityHI are out of sync. Falling back to library file for linking.
ld: warning: text-based stub file /System/Library/Frameworks/Carbon.framework/Versions/A/Frameworks/SpeechRecognition.framework/Versions/A/SpeechRecognition.tbd and library file /System/Library/Frameworks/Carbon.framework/Versions/A/Frameworks/SpeechRecognition.framework/Versions/A/SpeechRecognition are out of sync. Falling back to library file for linking.
ld: warning: text-based stub file /System/Library/PrivateFrameworks/UIFoundation.framework/Versions/A/UIFoundation.tbd and library file /System/Library/PrivateFrameworks/UIFoundation.framework/Versions/A/UIFoundation are out of sync. Falling back to library file for linking.
ld: warning: text-based stub file /System/Library/Frameworks//Foundation.framework/Versions/C/Foundation.tbd and library file /System/Library/Frameworks//Foundation.framework/Versions/C/Foundation are out of sync. Falling back to library file for linking.
ld: warning: text-based stub file /System/Library/Frameworks//CFNetwork.framework/Versions/A/CFNetwork.tbd and library file /System/Library/Frameworks//CFNetwork.framework/Versions/A/CFNetwork are out of sync. Falling back to library file for linking.
ld: warning: text-based stub file /System/Library/Frameworks/CoreServices.framework/Versions/A/Frameworks/FSEvents.framework/Versions/A/FSEvents.tbd and library file /System/Library/Frameworks/CoreServices.framework/Versions/A/Frameworks/FSEvents.framework/Versions/A/FSEvents are out of sync. Falling back to library file for linking.
ld: warning: text-based stub file /System/Library/Frameworks/CoreServices.framework/Versions/A/Frameworks/CarbonCore.framework/Versions/A/CarbonCore.tbd and library file /System/Library/Frameworks/CoreServices.framework/Versions/A/Frameworks/CarbonCore.framework/Versions/A/CarbonCore are out of sync. Falling back to library file for linking.
ld: warning: text-based stub file /System/Library/Frameworks/CoreServices.framework/Versions/A/Frameworks/Metadata.framework/Versions/A/Metadata.tbd and library file /System/Library/Frameworks/CoreServices.framework/Versions/A/Frameworks/Metadata.framework/Versions/A/Metadata are out of sync. Falling back to library file for linking.
ld: warning: text-based stub file /System/Library/Frameworks/CoreServices.framework/Versions/A/Frameworks/OSServices.framework/Versions/A/OSServices.tbd and library file /System/Library/Frameworks/CoreServices.framework/Versions/A/Frameworks/OSServices.framework/Versions/A/OSServices are out of sync. Falling back to library file for linking.
ld: warning: text-based stub file /System/Library/Frameworks/CoreServices.framework/Versions/A/Frameworks/SearchKit.framework/Versions/A/SearchKit.tbd and library file /System/Library/Frameworks/CoreServices.framework/Versions/A/Frameworks/SearchKit.framework/Versions/A/SearchKit are out of sync. Falling back to library file for linking.
ld: warning: text-based stub file /System/Library/Frameworks/CoreServices.framework/Versions/A/Frameworks/AE.framework/Versions/A/AE.tbd and library file /System/Library/Frameworks/CoreServices.framework/Versions/A/Frameworks/AE.framework/Versions/A/AE are out of sync. Falling back to library file for linking.
ld: warning: text-based stub file /System/Library/Frameworks/CoreServices.framework/Versions/A/Frameworks/LaunchServices.framework/Versions/A/LaunchServices.tbd and library file /System/Library/Frameworks/CoreServices.framework/Versions/A/Frameworks/LaunchServices.framework/Versions/A/LaunchServices are out of sync. Falling back to library file for linking.
ld: warning: text-based stub file /System/Library/Frameworks/CoreServices.framework/Versions/A/Frameworks/DictionaryServices.framework/Versions/A/DictionaryServices.tbd and library file /System/Library/Frameworks/CoreServices.framework/Versions/A/Frameworks/DictionaryServices.framework/Versions/A/DictionaryServices are out of sync. Falling back to library file for linking.
ld: warning: text-based stub file /System/Library/Frameworks/CoreServices.framework/Versions/A/Frameworks/SharedFileList.framework/Versions/A/SharedFileList.tbd and library file /System/Library/Frameworks/CoreServices.framework/Versions/A/Frameworks/SharedFileList.framework/Versions/A/SharedFileList are out of sync. Falling back to library file for linking.
ld: warning: object file (../../../libraries/osx/fmt/lib/libfmt.a(format.cc.o)) was built for newer OSX version (10.13) than being linked (10.12)
ld: warning: text-based stub file /System/Library/Frameworks//CoreFoundation.framework/CoreFoundation.tbd and library file /System/Library/Frameworks//CoreFoundation.framework/CoreFoundation are out of sync. Falling back to library file for linking.
ld: warning: text-based stub file /System/Library/Frameworks//CoreAudio.framework/CoreAudio.tbd and library file /System/Library/Frameworks//CoreAudio.framework/CoreAudio are out of sync. Falling back to library file for linking.
ld: warning: text-based stub file /System/Library/Frameworks//AudioToolbox.framework/AudioToolbox.tbd and library file /System/Library/Frameworks//AudioToolbox.framework/AudioToolbox are out of sync. Falling back to library file for linking.
ld: warning: text-based stub file /System/Library/Frameworks//ForceFeedback.framework/ForceFeedback.tbd and library file /System/Library/Frameworks//ForceFeedback.framework/ForceFeedback are out of sync. Falling back to library file for linking.
ld: warning: text-based stub file /System/Library/Frameworks//CoreVideo.framework/CoreVideo.tbd and library file /System/Library/Frameworks//CoreVideo.framework/CoreVideo are out of sync. Falling back to library file for linking.
ld: warning: text-based stub file /System/Library/Frameworks//Cocoa.framework/Cocoa.tbd and library file /System/Library/Frameworks//Cocoa.framework/Cocoa are out of sync. Falling back to library file for linking.
ld: warning: text-based stub file /System/Library/Frameworks//IOKit.framework/IOKit.tbd and library file /System/Library/Frameworks//IOKit.framework/IOKit are out of sync. Falling back to library file for linking.
ld: warning: text-based stub file /System/Library/Frameworks//QuartzCore.framework/QuartzCore.tbd and library file /System/Library/Frameworks//QuartzCore.framework/QuartzCore are out of sync. Falling back to library file for linking.
ld: warning: text-based stub file /System/Library/Frameworks//Metal.framework/Metal.tbd and library file /System/Library/Frameworks//Metal.framework/Metal are out of sync. Falling back to library file for linking.
ld: warning: text-based stub file /System/Library/Frameworks//Security.framework/Security.tbd and library file /System/Library/Frameworks//Security.framework/Security are out of sync. Falling back to library file for linking.
ld: warning: text-based stub file /System/Library/Frameworks//OpenAL.framework/OpenAL.tbd and library file /System/Library/Frameworks//OpenAL.framework/OpenAL are out of sync. Falling back to library file for linking.
ld: warning: text-based stub file /System/Library/Frameworks//AppKit.framework/Versions/C/AppKit.tbd and library file /System/Library/Frameworks//AppKit.framework/Versions/C/AppKit are out of sync. Falling back to library file for linking.
ld: warning: text-based stub file /System/Library/Frameworks//CoreData.framework/Versions/A/CoreData.tbd and library file /System/Library/Frameworks//CoreData.framework/Versions/A/CoreData are out of sync. Falling back to library file for linking.
ld: warning: text-based stub file /System/Library/Frameworks//ApplicationServices.framework/Versions/A/ApplicationServices.tbd and library file /System/Library/Frameworks//ApplicationServices.framework/Versions/A/ApplicationServices are out of sync. Falling back to library file for linking.
ld: warning: text-based stub file /System/Library/Frameworks/Carbon.framework/Versions/A/Frameworks/CommonPanels.framework/Versions/A/CommonPanels.tbd and library file /System/Library/Frameworks/Carbon.framework/Versions/A/Frameworks/CommonPanels.framework/Versions/A/CommonPanels are out of sync. Falling back to library file for linking.
ld: warning: text-based stub file /System/Library/Frameworks/Carbon.framework/Versions/A/Frameworks/HIToolbox.framework/Versions/A/HIToolbox.tbd and library file /System/Library/Frameworks/Carbon.framework/Versions/A/Frameworks/HIToolbox.framework/Versions/A/HIToolbox are out of sync. Falling back to library file for linking.
ld: warning: text-based stub file /System/Library/Frameworks/Carbon.framework/Versions/A/Frameworks/Help.framework/Versions/A/Help.tbd and library file /System/Library/Frameworks/Carbon.framework/Versions/A/Frameworks/Help.framework/Versions/A/Help are out of sync. Falling back to library file for linking.
ld: warning: text-based stub file /System/Library/Frameworks/Carbon.framework/Versions/A/Frameworks/ImageCapture.framework/Versions/A/ImageCapture.tbd and library file /System/Library/Frameworks/Carbon.framework/Versions/A/Frameworks/ImageCapture.framework/Versions/A/ImageCapture are out of sync. Falling back to library file for linking.
ld: warning: text-based stub file /System/Library/Frameworks/Carbon.framework/Versions/A/Frameworks/Ink.framework/Versions/A/Ink.tbd and library file /System/Library/Frameworks/Carbon.framework/Versions/A/Frameworks/Ink.framework/Versions/A/Ink are out of sync. Falling back to library file for linking.
ld: warning: text-based stub file /System/Library/Frameworks/Carbon.framework/Versions/A/Frameworks/OpenScripting.framework/Versions/A/OpenScripting.tbd and library file /System/Library/Frameworks/Carbon.framework/Versions/A/Frameworks/OpenScripting.framework/Versions/A/OpenScripting are out of sync. Falling back to library file for linking.
ld: warning: text-based stub file /System/Library/Frameworks/Carbon.framework/Versions/A/Frameworks/Print.framework/Versions/A/Print.tbd and library file /System/Library/Frameworks/Carbon.framework/Versions/A/Frameworks/Print.framework/Versions/A/Print are out of sync. Falling back to library file for linking.
ld: warning: text-based stub file /System/Library/Frameworks/Carbon.framework/Versions/A/Frameworks/SecurityHI.framework/Versions/A/SecurityHI.tbd and library file /System/Library/Frameworks/Carbon.framework/Versions/A/Frameworks/SecurityHI.framework/Versions/A/SecurityHI are out of sync. Falling back to library file for linking.
ld: warning: text-based stub file /System/Library/Frameworks/Carbon.framework/Versions/A/Frameworks/SpeechRecognition.framework/Versions/A/SpeechRecognition.tbd and library file /System/Library/Frameworks/Carbon.framework/Versions/A/Frameworks/SpeechRecognition.framework/Versions/A/SpeechRecognition are out of sync. Falling back to library file for linking.
ld: warning: text-based stub file /System/Library/Frameworks//CoreImage.framework/Versions/A/CoreImage.tbd and library file /System/Library/Frameworks//CoreImage.framework/Versions/A/CoreImage are out of sync. Falling back to library file for linking.
ld: warning: text-based stub file /System/Library/Frameworks//CoreGraphics.framework/Versions/A/CoreGraphics.tbd and library file /System/Library/Frameworks//CoreGraphics.framework/Versions/A/CoreGraphics are out of sync. Falling back to library file for linking.
ld: warning: text-based stub file /System/Library/Frameworks//CoreText.framework/Versions/A/CoreText.tbd and library file /System/Library/Frameworks//CoreText.framework/Versions/A/CoreText are out of sync. Falling back to library file for linking.
ld: warning: text-based stub file /System/Library/Frameworks//ImageIO.framework/Versions/A/ImageIO.tbd and library file /System/Library/Frameworks//ImageIO.framework/Versions/A/ImageIO are out of sync. Falling back to library file for linking.
ld: warning: text-based stub file /System/Library/Frameworks//ColorSync.framework/Versions/A/ColorSync.tbd and library file /System/Library/Frameworks//ColorSync.framework/Versions/A/ColorSync are out of sync. Falling back to library file for linking.
ld: warning: text-based stub file /System/Library/Frameworks/ApplicationServices.framework/Versions/A/Frameworks/ATS.framework/Versions/A/ATS.tbd and library file /System/Library/Frameworks/ApplicationServices.framework/Versions/A/Frameworks/ATS.framework/Versions/A/ATS are out of sync. Falling back to library file for linking.
ld: warning: text-based stub file /System/Library/Frameworks/ApplicationServices.framework/Versions/A/Frameworks/ColorSyncLegacy.framework/Versions/A/ColorSyncLegacy.tbd and library file /System/Library/Frameworks/ApplicationServices.framework/Versions/A/Frameworks/ColorSyncLegacy.framework/Versions/A/ColorSyncLegacy are out of sync. Falling back to library file for linking.
ld: warning: text-based stub file /System/Library/Frameworks//CoreServices.framework/Versions/A/CoreServices.tbd and library file /System/Library/Frameworks//CoreServices.framework/Versions/A/CoreServices are out of sync. Falling back to library file for linking.
ld: warning: text-based stub file /System/Library/Frameworks/ApplicationServices.framework/Versions/A/Frameworks/HIServices.framework/Versions/A/HIServices.tbd and library file /System/Library/Frameworks/ApplicationServices.framework/Versions/A/Frameworks/HIServices.framework/Versions/A/HIServices are out of sync. Falling back to library file for linking.
ld: warning: text-based stub file /System/Library/Frameworks/ApplicationServices.framework/Versions/A/Frameworks/LangAnalysis.framework/Versions/A/LangAnalysis.tbd and library file /System/Library/Frameworks/ApplicationServices.framework/Versions/A/Frameworks/LangAnalysis.framework/Versions/A/LangAnalysis are out of sync. Falling back to library file for linking.
ld: warning: text-based stub file /System/Library/Frameworks/ApplicationServices.framework/Versions/A/Frameworks/PrintCore.framework/Versions/A/PrintCore.tbd and library file /System/Library/Frameworks/ApplicationServices.framework/Versions/A/Frameworks/PrintCore.framework/Versions/A/PrintCore are out of sync. Falling back to library file for linking.
ld: warning: text-based stub file /System/Library/Frameworks/ApplicationServices.framework/Versions/A/Frameworks/QD.framework/Versions/A/QD.tbd and library file /System/Library/Frameworks/ApplicationServices.framework/Versions/A/Frameworks/QD.framework/Versions/A/QD are out of sync. Falling back to library file for linking.
ld: warning: text-based stub file /System/Library/Frameworks/ApplicationServices.framework/Versions/A/Frameworks/SpeechSynthesis.framework/Versions/A/SpeechSynthesis.tbd and library file /System/Library/Frameworks/ApplicationServices.framework/Versions/A/Frameworks/SpeechSynthesis.framework/Versions/A/SpeechSynthesis are out of sync. Falling back to library file for linking.
ld: warning: text-based stub file /System/Library/PrivateFrameworks/UIFoundation.framework/Versions/A/UIFoundation.tbd and library file /System/Library/PrivateFrameworks/UIFoundation.framework/Versions/A/UIFoundation are out of sync. Falling back to library file for linking.
ld: warning: text-based stub file /System/Library/Frameworks//Foundation.framework/Versions/C/Foundation.tbd and library file /System/Library/Frameworks//Foundation.framework/Versions/C/Foundation are out of sync. Falling back to library file for linking.
ld: warning: text-based stub file /System/Library/Frameworks//CFNetwork.framework/Versions/A/CFNetwork.tbd and library file /System/Library/Frameworks//CFNetwork.framework/Versions/A/CFNetwork are out of sync. Falling back to library file for linking.
ld: warning: text-based stub file /System/Library/Frameworks/CoreServices.framework/Versions/A/Frameworks/FSEvents.framework/Versions/A/FSEvents.tbd and library file /System/Library/Frameworks/CoreServices.framework/Versions/A/Frameworks/FSEvents.framework/Versions/A/FSEvents are out of sync. Falling back to library file for linking.
ld: warning: text-based stub file /System/Library/Frameworks/CoreServices.framework/Versions/A/Frameworks/CarbonCore.framework/Versions/A/CarbonCore.tbd and library file /System/Library/Frameworks/CoreServices.framework/Versions/A/Frameworks/CarbonCore.framework/Versions/A/CarbonCore are out of sync. Falling back to library file for linking.
ld: warning: text-based stub file /System/Library/Frameworks/CoreServices.framework/Versions/A/Frameworks/Metadata.framework/Versions/A/Metadata.tbd and library file /System/Library/Frameworks/CoreServices.framework/Versions/A/Frameworks/Metadata.framework/Versions/A/Metadata are out of sync. Falling back to library file for linking.
ld: warning: text-based stub file /System/Library/Frameworks/CoreServices.framework/Versions/A/Frameworks/OSServices.framework/Versions/A/OSServices.tbd and library file /System/Library/Frameworks/CoreServices.framework/Versions/A/Frameworks/OSServices.framework/Versions/A/OSServices are out of sync. Falling back to library file for linking.
ld: warning: text-based stub file /System/Library/Frameworks/CoreServices.framework/Versions/A/Frameworks/SearchKit.framework/Versions/A/SearchKit.tbd and library file /System/Library/Frameworks/CoreServices.framework/Versions/A/Frameworks/SearchKit.framework/Versions/A/SearchKit are out of sync. Falling back to library file for linking.
ld: warning: text-based stub file /System/Library/Frameworks//CoreFoundation.framework/Versions/A/CoreFoundation.tbd and library file /System/Library/Frameworks//CoreFoundation.framework/Versions/A/CoreFoundation are out of sync. Falling back to library file for linking.
ld: warning: text-based stub file /System/Library/Frameworks/CoreServices.framework/Versions/A/Frameworks/AE.framework/Versions/A/AE.tbd and library file /System/Library/Frameworks/CoreServices.framework/Versions/A/Frameworks/AE.framework/Versions/A/AE are out of sync. Falling back to library file for linking.
ld: warning: text-based stub file /System/Library/Frameworks/CoreServices.framework/Versions/A/Frameworks/LaunchServices.framework/Versions/A/LaunchServices.tbd and library file /System/Library/Frameworks/CoreServices.framework/Versions/A/Frameworks/LaunchServices.framework/Versions/A/LaunchServices are out of sync. Falling back to library file for linking.
ld: warning: text-based stub file /System/Library/Frameworks/CoreServices.framework/Versions/A/Frameworks/DictionaryServices.framework/Versions/A/DictionaryServices.tbd and library file /System/Library/Frameworks/CoreServices.framework/Versions/A/Frameworks/DictionaryServices.framework/Versions/A/DictionaryServices are out of sync. Falling back to library file for linking.
ld: warning: text-based stub file /System/Library/Frameworks/CoreServices.framework/Versions/A/Frameworks/SharedFileList.framework/Versions/A/SharedFileList.tbd and library file /System/Library/Frameworks/CoreServices.framework/Versions/A/Frameworks/SharedFileList.framework/Versions/A/SharedFileList are out of sync. Falling back to library file for linking.
ld: warning: object file (../../../libraries/osx/fmt/lib/libfmt.a(format.cc.o)) was built for newer OSX version (10.13) than being linked (10.12)
ld: warning: text-based stub file /System/Library/Frameworks//CoreFoundation.framework/CoreFoundation.tbd and library file /System/Library/Frameworks//CoreFoundation.framework/CoreFoundation are out of sync. Falling back to library file for linking.

Link to build: https://jenkins.wildfiregames.com/job/macos-differential/6273/display/redirect

Successful build - Chance fights ever on the side of the prudent.

Debug:
    17>wsecure_crt.obj : warning LNK4221: This object file does not define any previously undefined public symbols, so it will not be used by any link operation that consumes this library [E:\Jenkins\workspace\vs2015-differential\build\workspaces\vs2017\lowlevel.vcxproj]
    17>wprofiler.obj : warning LNK4221: This object file does not define any previously undefined public symbols, so it will not be used by any link operation that consumes this library [E:\Jenkins\workspace\vs2015-differential\build\workspaces\vs2017\lowlevel.vcxproj]
    17>manifest.obj : warning LNK4221: This object file does not define any previously undefined public symbols, so it will not be used by any link operation that consumes this library [E:\Jenkins\workspace\vs2015-differential\build\workspaces\vs2017\lowlevel.vcxproj]
    17>secure_crt.obj : warning LNK4221: This object file does not define any previously undefined public symbols, so it will not be used by any link operation that consumes this library [E:\Jenkins\workspace\vs2015-differential\build\workspaces\vs2017\lowlevel.vcxproj]
    17>posix.obj : warning LNK4221: This object file does not define any previously undefined public symbols, so it will not be used by any link operation that consumes this library [E:\Jenkins\workspace\vs2015-differential\build\workspaces\vs2017\lowlevel.vcxproj]
    17>vfs_path.obj : warning LNK4221: This object file does not define any previously undefined public symbols, so it will not be used by any link operation that consumes this library [E:\Jenkins\workspace\vs2015-differential\build\workspaces\vs2017\lowlevel.vcxproj]
    17>file_stats.obj : warning LNK4221: This object file does not define any previously undefined public symbols, so it will not be used by any link operation that consumes this library [E:\Jenkins\workspace\vs2015-differential\build\workspaces\vs2017\lowlevel.vcxproj]

Link to build: https://jenkins.wildfiregames.com/job/vs2015-differential/7363/display/redirect

Acording to https://trac.wildfiregames.com/wiki/Coding_Conventions#Errorreporting we should not use LOGWARNING:
"only use things defined in source/lib/"

Acording to https://trac.wildfiregames.com/wiki/Coding_Conventions#Errorreporting we should not use LOGWARNING:
"only use things defined in source/lib/"

  1. returning a vector of all failed file-paths is to much overhead.
  2. abort and return only the first dangling
  3. callback -> called to emmit a warning. I would have to make the callback everywere GetDirectoryEntries is called. A lot of duplicate work

Does somebody have a bether solution?

Silier added a subscriber: Silier.Aug 14 2022, 3:35 PM

I suggest to add some information explaining user what's wrong, they won't understand what it means