Page MenuHomeWildfire Games

[WIP] - Technologies to templates.
Changes PlannedPublic

Authored by Freagarach on Mar 31 2022, 8:24 AM.

Details

Reviewers
None
Group Reviewers
Restricted Owners Package(Owns No Changed Paths)
Summary

Allows inheritance, reduces duplication, removes the awkward "replaces" of the phases, allows verification.

A con is that we have more files now (a tech file per civ).

Stuff to do first:

  • unit_elephant* to mixin.
  • Civ-bonuses as player-auras?
  • Engine function to load all templates in a folder.

Modders can migrate part of their techs (it seems not all (yet)) with P267.

Test Plan

Techs are researchable as usual.
Template viewer still working.
Translations.
Checkrefs.
#2580

Unit TestsFailed

TimeTest
0 msJenkins > TestComponentScripts::Debug: Test / test_scripts
Test failed: Stack trace: @simulation/components/tests/test_Researcher.js:53:24 Expected equal, got [] !== ["gather_fishing_net", "phase_town_generic", "phase_city_generic"]
0 msJenkins > TestComponentScripts::Release: Test / test_scripts
Test failed: Stack trace: @simulation/components/tests/test_Researcher.js:53:24 Expected equal, got [] !== ["gather_fishing_net", "phase_town_generic", "phase_city_generic"]
0 msJenkins > cxxtest-debug-gcc7.xml::[failed-to-read]
Failed to read test report file /zpool0/trunk/cxxtest-debug-gcc7.xml org.dom4j.DocumentException: Error on line 1 of document : Content is not allowed in prolog. at org.dom4j.io.SAXReader.read(SAXReader.java:511)
0 msJenkins > cxxtest-debug.xml::[failed-to-read]
Failed to read test report file /Users/wfg/Jenkins/workspace/macos-differential/cxxtest-debug.xml org.dom4j.DocumentException: Error on line 1 of document : Content is not allowed in prolog. at org.dom4j.io.SAXReader.read(SAXReader.java:511)
0 msJenkins > TestAllocators::Debug: Test / test_da
View Full Test Results (4 Failed · 778 Passed)

Event Timeline

Freagarach created this revision.Mar 31 2022, 8:24 AM

Build failure - The Moirai have given mortals hearts that can endure.

builderr-debug-macos.txt
fatal errorfatal error: fatal errorfile '/Users/wfg/Jenkins/workspace/macos-differential/build/workspaces/gcc/../../../libraries/source/glad/include/glad/gl.h' has been modified since the precompiled header 'obj/graphics_Debug/precompiled.h.gch' was built: fatal error: : file '/Users/wfg/Jenkins/workspace/macos-differential/build/workspaces/gcc/../../../libraries/source/glad/include/glad/gl.h' has been modified since the precompiled header 'obj/graphics_Debug/precompiled.h.gch' was builtfile '/Users/wfg/Jenkins/workspace/macos-differential/build/workspaces/gcc/../../../libraries/source/glad/include/glad/gl.h' has been modified since the precompiled header 'obj/graphics_Debug/precompiled.h.gch' was built

file '/Users/wfg/Jenkins/workspace/macos-differential/build/workspaces/gcc/../../../libraries/source/glad/include/glad/gl.h' has been modified since the precompiled header 'obj/graphics_Debug/precompiled.h.gch' was built

note: note: please rebuild precompiled header 'obj/graphics_Debug/precompiled.h.gch'noteplease rebuild precompiled header 'obj/graphics_Debug/precompiled.h.gch': 

please rebuild precompiled header 'obj/graphics_Debug/precompiled.h.gch'
note: please rebuild precompiled header 'obj/graphics_Debug/precompiled.h.gch'
1 error generated.
make[1]: *** [obj/graphics_Debug/MiniMapTexture.o] Error 1
make[1]: *** Waiting for unfinished jobs....
1 error generated.
make[1]: *** [obj/graphics_Debug/CinemaManager.o] Error 1
1 error generated.
make[1]: *** [obj/graphics_Debug/MapGenerator.o] Error 1
1 error generated.
make[1]: *** [obj/graphics_Debug/MapReader.o] Error 1
make: *** [graphics] Error 2

Link to build: https://jenkins.wildfiregames.com/job/macos-differential/5889/display/redirect

Successful build - Chance fights ever on the side of the prudent.

Link to build: https://jenkins.wildfiregames.com/job/vs2015-differential/6980/display/redirect

Freagarach requested review of this revision.Mar 31 2022, 8:38 AM
Stan added a subscriber: Stan.Mar 31 2022, 8:48 AM

How does that work if I add that to say... A building?

Freagarach edited the test plan for this revision. (Show Details)Mar 31 2022, 4:53 PM
Freagarach edited the summary of this revision. (Show Details)Mar 31 2022, 6:08 PM
Freagarach edited the test plan for this revision. (Show Details)
Freagarach edited the summary of this revision. (Show Details)Mar 31 2022, 6:13 PM
Freagarach updated this revision to Diff 20039.EditedApr 1 2022, 5:53 PM

Saving some progress.

Vulcan added a comment.Apr 1 2022, 5:55 PM

Build failure - The Moirai have given mortals hearts that can endure.

builderr-debug-macos.txt
fatal error: fatal errorfatal error: : file '/Users/wfg/Jenkins/workspace/macos-differential/build/workspaces/gcc/../../../libraries/source/glad/include/glad/gl.h' has been modified since the precompiled header 'obj/graphics_Debug/precompiled.h.gch' was built
file '/Users/wfg/Jenkins/workspace/macos-differential/build/workspaces/gcc/../../../libraries/source/glad/include/glad/gl.h' has been modified since the precompiled header 'obj/graphics_Debug/precompiled.h.gch' was builtfile '/Users/wfg/Jenkins/workspace/macos-differential/build/workspaces/gcc/../../../libraries/source/glad/include/glad/gl.h' has been modified since the precompiled header 'obj/graphics_Debug/precompiled.h.gch' was built
fatal error
: notenote: file '/Users/wfg/Jenkins/workspace/macos-differential/build/workspaces/gcc/../../../libraries/source/glad/include/glad/gl.h' has been modified since the precompiled header 'obj/graphics_Debug/precompiled.h.gch' was builtplease rebuild precompiled header 'obj/graphics_Debug/precompiled.h.gch'
note: please rebuild precompiled header 'obj/graphics_Debug/precompiled.h.gch'
: please rebuild precompiled header 'obj/graphics_Debug/precompiled.h.gch'note: 

please rebuild precompiled header 'obj/graphics_Debug/precompiled.h.gch'
1 error generated.
make[1]: *** [obj/graphics_Debug/MiniMapTexture.o] Error 1
make[1]: *** Waiting for unfinished jobs....
1 error generated.
make[1]: *** [obj/graphics_Debug/CinemaManager.o] Error 1
1 error generated.
make[1]: *** [obj/graphics_Debug/MapGenerator.o] Error 1
1 error generated.
make[1]: *** [obj/graphics_Debug/MapReader.o] Error 1
make: *** [graphics] Error 2

Link to build: https://jenkins.wildfiregames.com/job/macos-differential/5891/display/redirect

Vulcan added a comment.Apr 1 2022, 5:59 PM

Build failure - The Moirai have given mortals hearts that can endure.

Link to build: https://jenkins.wildfiregames.com/job/docker-differential/7588/display/redirect

Vulcan added a comment.Apr 1 2022, 6:04 PM

Build failure - The Moirai have given mortals hearts that can endure.

Debug:
    17>wsecure_crt.obj : warning LNK4221: This object file does not define any previously undefined public symbols, so it will not be used by any link operation that consumes this library [E:\Jenkins\workspace\vs2015-differential\build\workspaces\vs2017\lowlevel.vcxproj]
    17>wprofiler.obj : warning LNK4221: This object file does not define any previously undefined public symbols, so it will not be used by any link operation that consumes this library [E:\Jenkins\workspace\vs2015-differential\build\workspaces\vs2017\lowlevel.vcxproj]
    17>manifest.obj : warning LNK4221: This object file does not define any previously undefined public symbols, so it will not be used by any link operation that consumes this library [E:\Jenkins\workspace\vs2015-differential\build\workspaces\vs2017\lowlevel.vcxproj]
    17>secure_crt.obj : warning LNK4221: This object file does not define any previously undefined public symbols, so it will not be used by any link operation that consumes this library [E:\Jenkins\workspace\vs2015-differential\build\workspaces\vs2017\lowlevel.vcxproj]
    17>posix.obj : warning LNK4221: This object file does not define any previously undefined public symbols, so it will not be used by any link operation that consumes this library [E:\Jenkins\workspace\vs2015-differential\build\workspaces\vs2017\lowlevel.vcxproj]
    17>vfs_path.obj : warning LNK4221: This object file does not define any previously undefined public symbols, so it will not be used by any link operation that consumes this library [E:\Jenkins\workspace\vs2015-differential\build\workspaces\vs2017\lowlevel.vcxproj]
    17>file_stats.obj : warning LNK4221: This object file does not define any previously undefined public symbols, so it will not be used by any link operation that consumes this library [E:\Jenkins\workspace\vs2015-differential\build\workspaces\vs2017\lowlevel.vcxproj]

Link to build: https://jenkins.wildfiregames.com/job/vs2015-differential/6982/display/redirect

Freagarach updated this revision to Diff 20095.Apr 17 2022, 7:18 AM

Saving some progress.

Build failure - The Moirai have given mortals hearts that can endure.

builderr-debug-macos.txt
ld: warning: text-based stub file /System/Library/Frameworks//CoreAudio.framework/CoreAudio.tbd and library file /System/Library/Frameworks//CoreAudio.framework/CoreAudio are out of sync. Falling back to library file for linking.
ld: warning: text-based stub file /System/Library/Frameworks//AudioToolbox.framework/AudioToolbox.tbd and library file /System/Library/Frameworks//AudioToolbox.framework/AudioToolbox are out of sync. Falling back to library file for linking.
ld: warning: text-based stub file /System/Library/Frameworks//ForceFeedback.framework/ForceFeedback.tbd and library file /System/Library/Frameworks//ForceFeedback.framework/ForceFeedback are out of sync. Falling back to library file for linking.
ld: warning: text-based stub file /System/Library/Frameworks//CoreVideo.framework/CoreVideo.tbd and library file /System/Library/Frameworks//CoreVideo.framework/CoreVideo are out of sync. Falling back to library file for linking.
ld: warning: text-based stub file /System/Library/Frameworks//Cocoa.framework/Cocoa.tbd and library file /System/Library/Frameworks//Cocoa.framework/Cocoa are out of sync. Falling back to library file for linking.
ld: warning: text-based stub file /System/Library/Frameworks//IOKit.framework/IOKit.tbd and library file /System/Library/Frameworks//IOKit.framework/IOKit are out of sync. Falling back to library file for linking.
ld: warning: text-based stub file /System/Library/Frameworks//QuartzCore.framework/QuartzCore.tbd and library file /System/Library/Frameworks//QuartzCore.framework/QuartzCore are out of sync. Falling back to library file for linking.
ld: warning: text-based stub file /System/Library/Frameworks//Metal.framework/Metal.tbd and library file /System/Library/Frameworks//Metal.framework/Metal are out of sync. Falling back to library file for linking.
ld: warning: text-based stub file /System/Library/Frameworks//Security.framework/Security.tbd and library file /System/Library/Frameworks//Security.framework/Security are out of sync. Falling back to library file for linking.
ld: warning: text-based stub file /System/Library/Frameworks//OpenAL.framework/OpenAL.tbd and library file /System/Library/Frameworks//OpenAL.framework/OpenAL are out of sync. Falling back to library file for linking.
ld: warning: text-based stub file /System/Library/Frameworks//AppKit.framework/Versions/C/AppKit.tbd and library file /System/Library/Frameworks//AppKit.framework/Versions/C/AppKit are out of sync. Falling back to library file for linking.
ld: warning: text-based stub file /System/Library/Frameworks//CoreData.framework/Versions/A/CoreData.tbd and library file /System/Library/Frameworks//CoreData.framework/Versions/A/CoreData are out of sync. Falling back to library file for linking.
ld: warning: text-based stub file /System/Library/Frameworks//ApplicationServices.framework/Versions/A/ApplicationServices.tbd and library file /System/Library/Frameworks//ApplicationServices.framework/Versions/A/ApplicationServices are out of sync. Falling back to library file for linking.
ld: warning: text-based stub file /System/Library/Frameworks/Carbon.framework/Versions/A/Frameworks/CommonPanels.framework/Versions/A/CommonPanels.tbd and library file /System/Library/Frameworks/Carbon.framework/Versions/A/Frameworks/CommonPanels.framework/Versions/A/CommonPanels are out of sync. Falling back to library file for linking.
ld: warning: text-based stub file /System/Library/Frameworks/Carbon.framework/Versions/A/Frameworks/HIToolbox.framework/Versions/A/HIToolbox.tbd and library file /System/Library/Frameworks/Carbon.framework/Versions/A/Frameworks/HIToolbox.framework/Versions/A/HIToolbox are out of sync. Falling back to library file for linking.
ld: warning: text-based stub file /System/Library/Frameworks/Carbon.framework/Versions/A/Frameworks/Help.framework/Versions/A/Help.tbd and library file /System/Library/Frameworks/Carbon.framework/Versions/A/Frameworks/Help.framework/Versions/A/Help are out of sync. Falling back to library file for linking.
ld: warning: text-based stub file /System/Library/Frameworks/Carbon.framework/Versions/A/Frameworks/ImageCapture.framework/Versions/A/ImageCapture.tbd and library file /System/Library/Frameworks/Carbon.framework/Versions/A/Frameworks/ImageCapture.framework/Versions/A/ImageCapture are out of sync. Falling back to library file for linking.
ld: warning: text-based stub file /System/Library/Frameworks/Carbon.framework/Versions/A/Frameworks/Ink.framework/Versions/A/Ink.tbd and library file /System/Library/Frameworks/Carbon.framework/Versions/A/Frameworks/Ink.framework/Versions/A/Ink are out of sync. Falling back to library file for linking.
ld: warning: text-based stub file /System/Library/Frameworks/Carbon.framework/Versions/A/Frameworks/OpenScripting.framework/Versions/A/OpenScripting.tbd and library file /System/Library/Frameworks/Carbon.framework/Versions/A/Frameworks/OpenScripting.framework/Versions/A/OpenScripting are out of sync. Falling back to library file for linking.
ld: warning: text-based stub file /System/Library/Frameworks/Carbon.framework/Versions/A/Frameworks/Print.framework/Versions/A/Print.tbd and library file /System/Library/Frameworks/Carbon.framework/Versions/A/Frameworks/Print.framework/Versions/A/Print are out of sync. Falling back to library file for linking.
ld: warning: text-based stub file /System/Library/Frameworks/Carbon.framework/Versions/A/Frameworks/SecurityHI.framework/Versions/A/SecurityHI.tbd and library file /System/Library/Frameworks/Carbon.framework/Versions/A/Frameworks/SecurityHI.framework/Versions/A/SecurityHI are out of sync. Falling back to library file for linking.
ld: warning: text-based stub file /System/Library/Frameworks/Carbon.framework/Versions/A/Frameworks/SpeechRecognition.framework/Versions/A/SpeechRecognition.tbd and library file /System/Library/Frameworks/Carbon.framework/Versions/A/Frameworks/SpeechRecognition.framework/Versions/A/SpeechRecognition are out of sync. Falling back to library file for linking.
ld: warning: text-based stub file /System/Library/Frameworks//CoreImage.framework/Versions/A/CoreImage.tbd and library file /System/Library/Frameworks//CoreImage.framework/Versions/A/CoreImage are out of sync. Falling back to library file for linking.
ld: warning: text-based stub file /System/Library/PrivateFrameworks/UIFoundation.framework/Versions/A/UIFoundation.tbd and library file /System/Library/PrivateFrameworks/UIFoundation.framework/Versions/A/UIFoundation are out of sync. Falling back to library file for linking.
ld: warning: text-based stub file /System/Library/Frameworks//Foundation.framework/Versions/C/Foundation.tbd and library file /System/Library/Frameworks//Foundation.framework/Versions/C/Foundation are out of sync. Falling back to library file for linking.
ld: warning: text-based stub file /System/Library/Frameworks//CoreGraphics.framework/Versions/A/CoreGraphics.tbd and library file /System/Library/Frameworks//CoreGraphics.framework/Versions/A/CoreGraphics are out of sync. Falling back to library file for linking.
ld: warning: text-based stub file /System/Library/Frameworks//CoreText.framework/Versions/A/CoreText.tbd and library file /System/Library/Frameworks//CoreText.framework/Versions/A/CoreText are out of sync. Falling back to library file for linking.
ld: warning: text-based stub file /System/Library/Frameworks//ImageIO.framework/Versions/A/ImageIO.tbd and library file /System/Library/Frameworks//ImageIO.framework/Versions/A/ImageIO are out of sync. Falling back to library file for linking.
ld: warning: text-based stub file /System/Library/Frameworks//ColorSync.framework/Versions/A/ColorSync.tbd and library file /System/Library/Frameworks//ColorSync.framework/Versions/A/ColorSync are out of sync. Falling back to library file for linking.
ld: warning: text-based stub file /System/Library/Frameworks/ApplicationServices.framework/Versions/A/Frameworks/ATS.framework/Versions/A/ATS.tbd and library file /System/Library/Frameworks/ApplicationServices.framework/Versions/A/Frameworks/ATS.framework/Versions/A/ATS are out of sync. Falling back to library file for linking.
ld: warning: text-based stub file /System/Library/Frameworks/ApplicationServices.framework/Versions/A/Frameworks/ColorSyncLegacy.framework/Versions/A/ColorSyncLegacy.tbd and library file /System/Library/Frameworks/ApplicationServices.framework/Versions/A/Frameworks/ColorSyncLegacy.framework/Versions/A/ColorSyncLegacy are out of sync. Falling back to library file for linking.
ld: warning: text-based stub file /System/Library/Frameworks//CoreServices.framework/Versions/A/CoreServices.tbd and library file /System/Library/Frameworks//CoreServices.framework/Versions/A/CoreServices are out of sync. Falling back to library file for linking.
ld: warning: text-based stub file /System/Library/Frameworks/ApplicationServices.framework/Versions/A/Frameworks/HIServices.framework/Versions/A/HIServices.tbd and library file /System/Library/Frameworks/ApplicationServices.framework/Versions/A/Frameworks/HIServices.framework/Versions/A/HIServices are out of sync. Falling back to library file for linking.
ld: warning: text-based stub file /System/Library/Frameworks/ApplicationServices.framework/Versions/A/Frameworks/LangAnalysis.framework/Versions/A/LangAnalysis.tbd and library file /System/Library/Frameworks/ApplicationServices.framework/Versions/A/Frameworks/LangAnalysis.framework/Versions/A/LangAnalysis are out of sync. Falling back to library file for linking.
ld: warning: text-based stub file /System/Library/Frameworks/ApplicationServices.framework/Versions/A/Frameworks/PrintCore.framework/Versions/A/PrintCore.tbd and library file /System/Library/Frameworks/ApplicationServices.framework/Versions/A/Frameworks/PrintCore.framework/Versions/A/PrintCore are out of sync. Falling back to library file for linking.
ld: warning: text-based stub file /System/Library/Frameworks/ApplicationServices.framework/Versions/A/Frameworks/QD.framework/Versions/A/QD.tbd and library file /System/Library/Frameworks/ApplicationServices.framework/Versions/A/Frameworks/QD.framework/Versions/A/QD are out of sync. Falling back to library file for linking.
ld: warning: text-based stub file /System/Library/Frameworks/ApplicationServices.framework/Versions/A/Frameworks/SpeechSynthesis.framework/Versions/A/SpeechSynthesis.tbd and library file /System/Library/Frameworks/ApplicationServices.framework/Versions/A/Frameworks/SpeechSynthesis.framework/Versions/A/SpeechSynthesis are out of sync. Falling back to library file for linking.
ld: warning: text-based stub file /System/Library/Frameworks//CoreFoundation.framework/Versions/A/CoreFoundation.tbd and library file /System/Library/Frameworks//CoreFoundation.framework/Versions/A/CoreFoundation are out of sync. Falling back to library file for linking.
ld: warning: text-based stub file /System/Library/Frameworks//CFNetwork.framework/Versions/A/CFNetwork.tbd and library file /System/Library/Frameworks//CFNetwork.framework/Versions/A/CFNetwork are out of sync. Falling back to library file for linking.
ld: warning: text-based stub file /System/Library/Frameworks/CoreServices.framework/Versions/A/Frameworks/FSEvents.framework/Versions/A/FSEvents.tbd and library file /System/Library/Frameworks/CoreServices.framework/Versions/A/Frameworks/FSEvents.framework/Versions/A/FSEvents are out of sync. Falling back to library file for linking.
ld: warning: text-based stub file /System/Library/Frameworks/CoreServices.framework/Versions/A/Frameworks/CarbonCore.framework/Versions/A/CarbonCore.tbd and library file /System/Library/Frameworks/CoreServices.framework/Versions/A/Frameworks/CarbonCore.framework/Versions/A/CarbonCore are out of sync. Falling back to library file for linking.
ld: warning: text-based stub file /System/Library/Frameworks/CoreServices.framework/Versions/A/Frameworks/Metadata.framework/Versions/A/Metadata.tbd and library file /System/Library/Frameworks/CoreServices.framework/Versions/A/Frameworks/Metadata.framework/Versions/A/Metadata are out of sync. Falling back to library file for linking.
ld: warning: text-based stub file /System/Library/Frameworks/CoreServices.framework/Versions/A/Frameworks/OSServices.framework/Versions/A/OSServices.tbd and library file /System/Library/Frameworks/CoreServices.framework/Versions/A/Frameworks/OSServices.framework/Versions/A/OSServices are out of sync. Falling back to library file for linking.
ld: warning: text-based stub file /System/Library/Frameworks/CoreServices.framework/Versions/A/Frameworks/SearchKit.framework/Versions/A/SearchKit.tbd and library file /System/Library/Frameworks/CoreServices.framework/Versions/A/Frameworks/SearchKit.framework/Versions/A/SearchKit are out of sync. Falling back to library file for linking.
ld: warning: text-based stub file /System/Library/Frameworks/CoreServices.framework/Versions/A/Frameworks/AE.framework/Versions/A/AE.tbd and library file /System/Library/Frameworks/CoreServices.framework/Versions/A/Frameworks/AE.framework/Versions/A/AE are out of sync. Falling back to library file for linking.
ld: warning: text-based stub file /System/Library/Frameworks/CoreServices.framework/Versions/A/Frameworks/LaunchServices.framework/Versions/A/LaunchServices.tbd and library file /System/Library/Frameworks/CoreServices.framework/Versions/A/Frameworks/LaunchServices.framework/Versions/A/LaunchServices are out of sync. Falling back to library file for linking.
ld: warning: text-based stub file /System/Library/Frameworks/CoreServices.framework/Versions/A/Frameworks/DictionaryServices.framework/Versions/A/DictionaryServices.tbd and library file /System/Library/Frameworks/CoreServices.framework/Versions/A/Frameworks/DictionaryServices.framework/Versions/A/DictionaryServices are out of sync. Falling back to library file for linking.
ld: warning: text-based stub file /System/Library/Frameworks/CoreServices.framework/Versions/A/Frameworks/SharedFileList.framework/Versions/A/SharedFileList.tbd and library file /System/Library/Frameworks/CoreServices.framework/Versions/A/Frameworks/SharedFileList.framework/Versions/A/SharedFileList are out of sync. Falling back to library file for linking.
ld: warning: object file (../../../libraries/osx/fmt/lib/libfmt.a(format.cc.o)) was built for newer OSX version (10.13) than being linked (10.12)
ld: warning: text-based stub file /System/Library/Frameworks//CoreFoundation.framework/CoreFoundation.tbd and library file /System/Library/Frameworks//CoreFoundation.framework/CoreFoundation are out of sync. Falling back to library file for linking.

Link to build: https://jenkins.wildfiregames.com/job/macos-differential/5935/display/redirect

Build failure - The Moirai have given mortals hearts that can endure.

Link to build: https://jenkins.wildfiregames.com/job/vs2015-differential/7025/display/redirect

Build failure - The Moirai have given mortals hearts that can endure.

Link to build: https://jenkins.wildfiregames.com/job/docker-differential/7631/display/redirect